program: Gaussian 09
title: 000090614
version: EM64L-G09RevD.01
frameworkgroup: C1[X(C2H2N4O2)]
method: RPBEPBE
basis: SDD
operation: Freq
keyword: #pfreq=noraman
keyword: PBEPBE/SDD
title: #p freq=noraman PBEPBE/SDD
converged: YES YES NO YES
title: Mulliken charges:
elementType: O O N N N N C C H H
charge: -0.140617 -0.215629 -0.366544 -0.034966 0.084064 0.010633 0.241875 -0.240996 0.380938 0.281242
chargesum: 0.00000
title: Mulliken charges with hydrogens summed into heavy atoms:
elementType: O O N N N N C C
charge: -0.140617 -0.215629 0.014394 -0.034966 0.084064 0.010633 0.241875 0.040245
polarizability: 8.13550647e+01 -6.50814804e-01 6.25509509e+01 8.50498423e-04 2.53314411e-03 2.33322213e+01
1716.lowfreq: -10.8052 -2.8861 -0.0010 -0.0007 0.0007 5.8677 81.1731 203.7810 214.7697
frequency: 81.1729 203.7809 214.7678 416.6561 508.6240 608.6446 654.4970 721.4235 749.3869 771.7385 854.9280 913.3409 982.0106 1064.9948 1137.8814 1192.7144 1218.2640 1260.4727 1314.3622 1362.7415 1397.4451 1445.1315 3269.3150 3593.1835
redmass: 9.6419 7.7310 8.5031 11.7805 10.0942 10.8399 4.3290 12.3382 14.3020 1.1370 1.3604 9.4435 4.5524 3.5959 4.7641 2.7471 7.6849 2.7779 2.7838 5.1474 9.5463 3.1777 1.1001 1.0839
irintensity: 1.6552 2.8050 4.6527 0.6647 0.0648 1.7214 11.1573 0.2789 32.6396 128.1092 34.4878 10.8382 30.0171 29.9859 48.2424 15.2055 14.5059 136.1604 55.5550 79.7729 79.7260 4.1215 0.4838 122.4350
temp: 298.150 k
press: 1.00000 atm
elementType: 8 8 7 7 7 7 6 6 1 1
symmnumber: 1
zpe: 155140.6 jmol-1
zpe.correction: 0.059090 hartree
zpe.thermalcorrener: 0.065155 hartree
zpe.thermalcorrenthalpy: 0.066099 hartree
zpe.thermalcorrgfe: 0.028259 hartree
zpe.sumelectzpe: -446.155225 hartree
zpe.sumelectthermal: -446.149160 hartree
zpe.sumelectthermalent: -446.148216 hartree
zpe.sumelectthermalfe: -446.186056 hartree
dipole: 2.6481 1.8526 0.0005
dipole: 3.2318
quadrupole: -51.2855 -46.5466 -43.8199
quadrupole: -3.3863 0.0000 0.0000
quadrupole: -4.0681 0.6707 3.3974 -3.3863 0.0000 0.0000
hfenergy: -446.2143148 hartree
pointgroup: C01 [X(C2H2N4O2)]
dipole: 1.060862 0.7009005 0.0002084 debye
dipolederiv: -0.5980006 -0.2141368 -0.0000088 -0.1525889 -0.593308 -0.0000151 -0.0000357 -0.0000341 -0.1773308 -0.5840668 0.1112758 0.0000031 0.1432881 -0.7172076 -0.000026 0.0000265 -0.0000182 -0.2380613 0.0967606 0.2619922 -0.0000175 0.2044155 -0.4606004 -0.000043 0.0000245 -0.0001103 -0.1479613 -0.1099019 0.0906508 0.0000463 -0.0830749 -0.3470601 -0.0000059 -0.0000278 -0.0000212 -0.1666589 1.6166805 0.0509754 0.0000243 -0.0091253 1.1582029 0.0000274 -0.0000074 0.0000589 0.2194589 -0.3619023 -0.2214457 -0.0000758 0.2185237 -0.1030181 -0.0000469 -0.0000482 0.0000722 -0.1529488 -0.5448738 -0.0189149 -0.0000073 0.0682959 0.4258384 0.0001079 0.0000341 0.0000357 0.1652752 0.1949856 -0.1004447 0.0000287 -0.4238927 0.1945273 0.0000046 -0.0000218 0.0000569 -0.0580658 0.2318013 0.0114862 0.0000112 0.0043646 0.3380669 0.000003 -0.0000002 0.0000092 0.3710441 0.0585175 0.0285617 -0.0000042 0.0297939 0.1045588 -0.0000062 0.000056 -0.000049 0.1852487 unknown
polarizability: 81.3071887|-1.1495799|62.5988269|0.0009175|0.0025096|23.3322213 unknown
InChI: InChI=1S/C2H2N4O2/c7-6(8)2-3-1-4-5-2/h1,5H
charge 0 multiplicity 1
10 atoms
O  -2.175567 -1.043255 -0.00006
O  -1.935962 1.243263 0.000052
N  0.769202 1.050221 0.000177
N  0.732833 -1.193399 -0.000191
N  -1.474888 0.025953 0.000024
N  2.104036 0.687488 -0.000029
C  -0.022568 -0.076902 0.000014
C  2.02165 -0.685924 0.000068
H  0.478083 2.028423 0.000284
H  2.912181 -1.307467 -0.000038
