program: Gaussian 09
title: 000093432
version: EM64L-G09RevD.01
frameworkgroup: C1[X(C24H27O4P)]
method: RPBEPBE
basis: SDD
operation: Freq
keyword: #p
keyword: freq=noraman
keyword: PBEPBE/SDD
title: #p freq=noraman PBEPBE/SDD
converged: NO YES NO NO
title: Mulliken charges:
elementType: P O O O O C C C C C C C C C C C C C C C C C C C C C C C C H H H H H H H H H H H H H H H H H H H H H H H H H H H
charge: 1.325820 -0.555187 -0.523421 -0.538567 -0.577290 0.054075 0.042921 0.378899 0.370539 0.398165 0.382786 0.489987 0.488613 -0.603195 -0.600264 -0.593648 -0.591981 -0.804962 -0.817768 -0.819364 -0.815839 -0.815775 -0.815654 0.380393 -0.337696 -0.368059 -0.200206 -0.193749 -0.245901 0.239931 0.240551 0.238843 0.239380 0.268979 0.215706 0.238687 0.241148 0.278859 0.214783 0.242698 0.274320 0.221333 0.276913 0.218324 0.240737 0.234824 0.225186 0.225921 0.225261 0.235929 0.224784 0.290719 0.258469 0.231362 0.231745 0.230940
chargesum: 0.00000
title: Mulliken charges with hydrogens summed into heavy atoms:
elementType: P O O O O C C C C C C C C C C C C C C C C C C C C C C C C
charge: 1.325820 -0.555187 -0.523421 -0.538567 -0.577290 0.054075 0.042921 0.378899 0.370539 0.398165 0.382786 0.489987 0.488613 -0.363263 -0.359712 -0.354804 -0.352601 -0.081591 -0.082978 -0.081013 -0.079865 -0.129843 -0.129680 0.380393 -0.046977 -0.109591 0.031155 0.037996 -0.014961
polarizability: 3.28423686e+02 -3.65762115e+00 3.44304649e+02 1.49462013e+01 1.23074032e+01 2.51715691e+02
1716.lowfreq: -42.3633 -38.0826 -11.1054 -7.3024 -3.1373 -0.0008 -0.0004 0.0000 6.9019
frequency: -42.3343 -38.0565 -6.4163 10.6736 16.7338 22.0008 33.5264 43.5242 56.3224 80.6932 90.3887 101.7926 107.8841 121.8941 133.8879 137.8558 146.9863 157.0373 168.4811 177.6366 179.8112 188.3297 228.5648 228.9809 245.7149 264.2827 268.0538 272.4173 273.7359 288.3469 299.3262 315.7932 335.1930 351.7776 401.0226 409.3305 418.8958 469.0153 474.7332 483.7599 491.5161 493.2332 518.1561 519.5197 536.5943 552.4887 561.7154 562.3712 563.7644 566.8989 581.2981 593.4646 608.8787 636.8719 673.9556 690.4418 735.5721 736.3693 763.4802 778.8106 799.9409 826.5124 837.0143 866.1942 867.1883 891.7262 893.0185 915.3788 935.8982 936.6241 953.8187 954.6539 970.9617 986.0480 990.5087 1016.6205 1017.3879 1017.6730 1019.1669 1020.7378 1032.7086 1042.6771 1043.1588 1045.9448 1046.1985 1051.7458 1053.2236 1053.6267 1055.1482 1077.0060 1099.2531 1107.4272 1153.5096 1170.1149 1184.1571 1188.9338 1192.1035 1256.4539 1257.9801 1310.8759 1328.1331 1328.7156 1368.5058 1369.8448 1381.2560 1396.8960 1397.0575 1401.2408 1403.7221 1405.8088 1407.0894 1415.8217 1415.9393 1431.5685 1432.3087 1440.8446 1462.0869 1462.9465 1464.0531 1464.9078 1470.1179 1473.0049 1473.7873 1475.1782 1475.5581 1484.8200 1487.4032 1493.9231 1496.2032 1594.0260 1602.6941 1603.2016 1605.0355 1610.3353 1610.5357 2974.6410 2975.2594 2980.6700 2982.2053 2985.4514 2986.1718 3056.0229 3056.5307 3061.9147 3063.7013 3066.0947 3067.7164 3084.8515 3085.4070 3090.8687 3091.1295 3093.9732 3094.3254 3118.9046 3119.5749 3123.2101 3123.8168 3132.2877 3142.6900 3157.4608 3167.2641 3177.4764
redmass: 1.0117 1.0096 4.4855 4.7398 4.0733 4.3545 4.1066 4.3396 4.8378 4.0645 1.3844 2.9569 2.6319 3.5835 1.0985 1.3919 1.1281 3.4999 4.3445 3.0917 3.0295 4.8707 2.9435 2.8640 5.9271 3.1424 2.6543 3.1355 3.4466 4.1111 4.7165 4.7327 5.8181 5.4765 6.8672 2.9618 8.3568 5.8293 6.4972 4.3946 3.6289 3.8277 3.1158 3.1023 5.5183 5.3565 4.3155 4.2348 4.2781 4.4585 3.3486 3.9957 6.5737 7.0974 8.6370 2.2652 3.8428 3.8148 1.5392 6.3896 7.8513 7.6104 1.2637 1.3054 1.2998 1.3125 1.3100 1.4137 2.3239 2.3492 3.4793 3.5725 1.3714 5.2711 1.3678 1.6363 1.6296 1.5930 1.6767 2.1898 9.1767 1.7827 1.7570 1.5395 1.5429 1.5391 1.5712 1.5577 1.5412 1.5394 6.6533 5.8740 2.4477 1.1095 1.2633 1.4568 1.5012 1.3731 1.3816 1.3199 6.6140 6.5094 6.8414 6.8353 9.2056 1.2314 1.2321 1.2940 1.3931 1.2349 1.3156 2.1911 2.1690 2.2520 2.2421 2.2505 1.0591 1.0692 1.0493 1.0520 2.1079 1.0555 1.0571 1.1029 1.1051 1.2130 1.1565 1.2732 1.2742 6.2047 7.6656 6.6716 7.7337 5.6398 5.7211 1.0387 1.0387 1.0372 1.0368 1.0371 1.0366 1.0949 1.0949 1.0974 1.0974 1.0964 1.0968 1.0998 1.0998 1.0993 1.0997 1.1002 1.1001 1.0914 1.0913 1.0920 1.0919 1.0851 1.0896 1.0938 1.0976 1.0993
irintensity: 0.3806 0.4011 0.4416 0.3323 0.2069 0.3459 0.0884 0.3256 0.7095 0.1810 0.1995 1.9659 0.3353 1.1997 0.6649 0.9754 1.3486 1.0233 3.1272 3.9033 5.3381 4.4106 0.1477 0.1135 3.3835 2.2190 2.6649 2.9923 4.0516 8.3706 4.6250 4.6850 5.7813 5.4154 43.9507 1.4002 42.7337 27.4399 20.3942 27.1970 1.9311 5.6865 0.0994 0.2643 2.0090 17.3312 1.0676 1.7486 0.6421 5.6452 19.0312 1.8625 8.6511 81.2007 92.8259 24.7232 11.6882 7.8198 84.5519 66.9814 267.7265 340.7682 9.3680 23.3240 23.4254 0.0337 0.0740 13.3047 1.2092 0.9703 8.0447 3.7344 0.7812 2.3497 1.1752 6.8370 8.3979 1.8489 12.3997 29.3706 67.1285 0.5025 0.3434 3.9565 3.9740 9.0741 24.9201 20.6654 10.3524 8.5545 215.1131 120.8136 163.2520 15.7445 48.4027 29.0177 2.6783 0.1718 0.1406 0.2654 1.3483 1.4974 4.3387 4.4198 1.0003 13.7882 10.2359 13.8068 11.9050 2.0881 6.8299 2.5514 3.6437 6.1942 3.7063 8.7701 8.8974 4.3339 16.4004 9.5312 141.5923 12.5749 11.2674 2.3699 4.4986 34.9242 29.7212 86.9938 47.7390 49.7045 7.7259 26.6390 5.9098 14.8205 12.6010 45.1227 40.6701 16.3876 20.0960 17.0641 22.2057 20.9868 20.1929 7.8366 7.6868 10.4942 7.3424 15.8987 16.0250 16.8558 24.9613 22.1316 16.1991 23.0114 23.4439 19.2193 14.5510 0.2350 15.1177 17.6684 15.0304 8.7384
temp: 298.150 k
press: 1.00000 atm
elementType: 15 8 8 8 8 6 6 6 6 6 6 6 6 6 6 6 6 6 6 6 6 6 6 6 6 6 6 6 6 1 1 1 1 1 1 1 1 1 1 1 1 1 1 1 1 1 1 1 1 1 1 1 1 1 1 1
symmnumber: 1
zpe: 1169369.5 jmol-1
zpe.correction: 0.445389 hartree
zpe.thermalcorrener: 0.474040 hartree
zpe.thermalcorrenthalpy: 0.474984 hartree
zpe.thermalcorrgfe: 0.383899 hartree
zpe.sumelectzpe: -1570.780750 hartree
zpe.sumelectthermal: -1570.752100 hartree
zpe.sumelectthermalent: -1570.751156 hartree
zpe.sumelectthermalfe: -1570.842241 hartree
dipole: -0.2461 -0.7276 0.5150
dipole: 0.9248
quadrupole: -162.8555 -157.8338 -174.1348
quadrupole: -1.8956 3.5002 2.4849
quadrupole: 2.0859 7.1076 -9.1935 -1.8956 3.5002 2.4849
hfenergy: -1571.2261397 hartree
pointgroup: C01 [X(C24H27O4P1)]
dipole: 0.1608318 0.2614116 0.1953707 debye
polarizability: 328.0669576|0.0212421|344.3700263|-16.5325385|-11.6668972|252.0070419 unknown
InChI: InChI=1S/C24H27O4P/c1-16-12-18(3)23(19(4)13-16)27-29(25,26-22-10-8-7-9-11-22)28-24-20(5)14-17(2)15-21(24)6/h7-15H,1-6H3
charge 0 multiplicity 1
56 atoms
P  -0.119233 -0.615083 -0.149026
O  -0.950177 0.650397 0.693866
O  1.439411 -0.580698 0.606227
O  -0.769529 -2.008665 0.650816
O  -0.199732 -0.604664 -1.735973
C  -2.156212 1.261289 0.192099
C  2.398784 0.470323 0.374791
C  -3.3815 0.864204 0.781923
C  2.520872 1.473607 1.368905
C  -2.05105 2.301672 -0.764068
C  3.256757 0.381113 -0.75016
C  -4.508013 2.580085 -0.604403
C  4.398466 2.42547 0.061886
C  -4.550497 1.540951 0.357731
C  3.528903 2.450055 1.180193
C  -3.252143 2.944603 -1.149374
C  4.248108 1.383119 -0.885743
C  -3.433607 -0.230151 1.828628
C  1.623956 1.487805 2.589777
C  -0.715218 2.707511 -1.353596
C  3.129711 -0.742938 -1.759188
C  -5.775175 3.3080 -1.019751
C  5.490768 3.469135 -0.097622
C  -0.380577 -3.346272 0.311225
C  -0.25912 -3.779426 -1.027655
C  -0.203749 -4.224744 1.399559
C  0.058992 -5.135739 -1.26779
C  0.100805 -5.579115 1.138691
C  0.236551 -6.037649 -0.193013
H  -5.513714 1.248293 0.793691
H  3.638797 3.241238 1.932277
H  -3.200522 3.75053 -1.892005
H  4.920751 1.340046 -1.751344
H  -2.976072 -1.166623 1.463084
H  -4.475371 -0.43788 2.125285
H  -2.865012 0.059104 2.731945
H  1.748637 0.56099 3.179584
H  0.55776 1.536858 2.30599
H  1.860195 2.348192 3.238211
H  0.034904 2.89923 -0.564468
H  -0.309403 1.907451 -2.000666
H  -0.818067 3.621663 -1.961896
H  2.175136 -0.682753 -2.313338
H  3.957781 -0.709317 -2.486836
H  3.144649 -1.728432 -1.258434
H  -5.941254 4.206929 -0.394365
H  -6.665707 2.664283 -0.912156
H  -5.722509 3.64518 -2.069997
H  5.716749 3.659618 -1.161551
H  6.431621 3.137264 0.383438
H  5.205532 4.428697 0.368246
H  -0.407559 -3.075639 -1.852994
H  -0.303909 -3.841324 2.41904
H  0.158865 -5.486052 -2.300955
H  0.237822 -6.271377 1.976505
H  0.477348 -7.087565 -0.390643
