program: Gaussian 09
title: 000093437
version: EM64L-G09RevD.01
frameworkgroup: C1[X(C24H27O4P)]
method: RPBEPBE
basis: SDD
operation: Freq
keyword: #p
keyword: freq=noraman
keyword: PBEPBE/SDD
title: #p freq=noraman PBEPBE/SDD
converged: YES YES NO NO
title: Mulliken charges:
elementType: P O O O O C C C C C C C C C C C C C C C C C C C C C C C C H H H H H H H H H H H H H H H H H H H H H H H H H H H
charge: 1.315742 -0.543618 -0.539560 -0.549737 -0.561717 0.065408 0.232160 0.236807 0.354679 0.371311 0.313507 0.318813 -0.468999 -0.459155 0.482280 0.481468 -0.413571 -0.410128 -0.378265 -0.378008 -0.435159 -0.437156 -0.225335 -0.802611 -0.809595 -0.792609 -0.793725 -0.806194 -0.806228 0.270833 0.268709 0.235930 0.235633 0.233445 0.233086 0.231168 0.230962 0.226264 0.214786 0.274550 0.238243 0.277779 0.241089 0.218910 0.259817 0.237803 0.215272 0.214634 0.260737 0.238860 0.235198 0.233151 0.222132 0.234435 0.221932 0.233839
chargesum: 0.00000
title: Mulliken charges with hydrogens summed into heavy atoms:
elementType: P O O O O C C C C C C C C C C C C C C C C C C C C C C C C
charge: 1.315742 -0.543618 -0.539560 -0.549737 -0.561717 0.065408 0.232160 0.236807 0.354679 0.371311 0.313507 0.318813 -0.198166 -0.190446 0.482280 0.481468 -0.177640 -0.174494 -0.144820 -0.144922 -0.203991 -0.206194 0.000928 -0.075033 -0.071817 -0.079718 -0.079493 -0.115712 -0.116023
polarizability: 3.26494981e+02 -2.24304391e-01 3.06072197e+02 -7.04399466e+00 3.37004105e+00 2.80342862e+02
1716.lowfreq: -6.8940 -0.0013 -0.0011 -0.0010 2.6849 6.8892 11.9687 14.6604 18.3921
frequency: 10.3001 14.1722 17.9431 22.3550 27.7303 39.3494 44.5075 46.9452 67.1246 72.9392 89.3868 110.9872 115.6425 117.3117 122.7280 128.6984 129.6366 140.8919 145.8246 159.8395 176.6237 200.8750 217.1724 228.4527 254.0245 268.7581 269.9027 283.7965 300.3392 309.3585 316.7138 321.8737 324.9309 371.6350 381.1021 434.8681 438.4186 449.7106 454.9383 464.2879 475.1227 482.4437 493.3514 512.8422 517.5846 518.5438 538.0544 554.2978 586.3604 595.6066 605.4585 649.2658 677.9601 708.5340 714.4510 715.7651 735.0403 736.9091 739.2486 764.3340 773.7448 780.1928 820.2529 821.3984 832.1941 889.1678 889.8957 896.0683 918.5782 919.8546 921.1223 953.8765 954.5698 975.2724 990.3853 994.6200 996.6478 1009.7743 1011.4208 1038.1259 1043.3204 1048.1079 1048.3098 1050.5088 1051.7009 1052.6984 1054.8975 1081.4448 1081.9550 1091.1491 1132.9197 1154.1551 1154.9555 1177.0956 1216.6420 1218.8659 1246.5851 1248.8506 1260.1743 1277.0606 1279.6967 1281.5819 1366.3316 1366.7295 1371.2350 1396.8389 1397.7057 1399.6590 1400.6064 1402.1024 1404.0187 1405.2636 1406.8201 1423.1990 1454.8049 1459.5066 1461.5815 1463.4448 1464.9401 1468.0359 1469.9008 1471.1048 1471.6982 1480.8918 1482.5613 1486.5881 1490.4174 1501.9249 1503.1831 1580.2223 1580.8698 1593.6810 1609.7712 1623.7356 1625.0036 2978.0183 2978.1062 2981.3722 2981.7551 2983.4811 2985.6181 3057.6678 3057.8818 3062.0096 3062.2285 3063.6444 3066.0539 3086.1589 3086.9135 3091.1372 3091.9169 3092.7727 3095.0544 3121.1037 3121.3081 3124.8141 3135.7947 3144.0679 3144.1671 3149.4034 3150.9333 3158.8519
redmass: 4.6616 4.2495 4.0617 4.0074 4.5709 4.1905 1.0273 1.0459 5.0785 5.1084 3.4025 1.1544 2.0734 1.1296 2.1002 2.2480 1.5142 1.5728 3.1780 3.1554 4.8175 5.3491 5.3076 2.9889 4.2795 3.5558 3.3888 3.1192 3.5667 3.3789 4.4129 3.8967 4.1842 5.6659 6.2533 3.8079 3.9264 3.4644 3.6367 3.8708 3.8010 5.1992 4.3681 5.9577 3.4893 5.2166 5.7199 4.5657 5.0329 4.4720 5.1042 7.3421 7.9325 6.7257 3.2093 3.2596 4.9689 4.4735 4.6088 6.2265 7.8957 1.2135 1.2609 1.2596 6.6557 1.3867 1.3798 1.3102 3.1997 2.6517 3.0301 1.3489 1.3482 1.3383 1.6185 1.7665 1.7805 1.3525 1.3504 9.6996 1.7664 1.5468 1.5661 1.5396 1.5248 1.5189 1.5690 2.5041 3.1918 2.7098 3.0400 1.3505 1.3493 1.1660 1.7300 1.7483 5.9974 5.9516 1.5715 3.2950 1.4007 1.3809 4.8174 4.8728 6.9706 1.6691 1.5514 1.2935 1.3765 1.6280 1.5191 1.6224 1.2451 2.5577 1.9168 1.0512 1.0589 1.0505 1.0829 1.0824 1.0702 1.0548 1.0710 1.1004 1.1319 1.1982 1.1827 3.2439 3.2129 5.5398 5.4992 5.3448 8.0566 7.2157 7.1832 1.0376 1.0375 1.0371 1.0366 1.0366 1.0369 1.0971 1.0968 1.0972 1.0974 1.0971 1.0965 1.0992 1.0992 1.1001 1.0994 1.1000 1.1002 1.0874 1.0874 1.0857 1.0921 1.0957 1.0958 1.0938 1.0934 1.0995
irintensity: 0.1896 0.1509 0.1325 0.1304 0.3329 0.2812 0.5141 0.5778 1.1913 0.2959 0.4204 0.5359 0.9150 0.7013 0.8743 0.7986 0.7334 0.0737 2.0464 2.5810 1.6190 10.1524 4.1308 0.6522 6.6894 1.9049 0.7037 3.9255 2.8033 0.6303 2.4250 2.6006 1.8925 33.0976 46.9557 11.2317 11.6896 5.4002 10.8319 3.7824 6.6416 20.7165 38.0181 6.3816 2.8861 14.0301 0.8979 12.5507 5.2017 9.5143 21.1191 23.2744 61.3429 48.7551 0.1153 2.1596 36.1099 13.3925 26.3231 70.2467 229.4822 71.5946 33.4822 34.1682 160.6215 5.6836 14.8548 0.0358 117.5692 9.9894 43.1358 0.7157 0.7555 0.2782 7.3703 52.5964 30.2690 1.7460 1.7334 67.9643 1.1565 3.6784 3.4540 13.6781 20.4912 22.2722 9.4852 163.5930 181.6651 12.3504 66.2883 1.0622 2.4218 1.4925 3.6516 3.5360 69.6237 21.6209 0.1126 5.7597 0.0492 0.1624 9.1273 4.0961 4.9400 23.5265 27.4221 3.4173 1.6845 6.8138 19.9179 11.5442 9.7759 9.8764 1.7348 6.6531 5.6754 20.8834 1.4979 6.5566 6.5943 13.0925 4.1475 63.1492 55.5528 21.0498 44.3491 53.2640 55.7590 22.3942 14.1115 1.4217 4.2215 19.2288 17.9941 21.8072 49.0952 14.9155 25.0813 19.5617 19.9684 17.6532 18.2340 12.4242 7.6021 10.6683 9.6094 20.2533 19.0256 25.0722 25.5094 23.4578 20.0854 10.5684 11.5434 0.1602 22.0705 42.7690 19.2596 2.3740 0.5571 35.1868
temp: 298.150 k
press: 1.00000 atm
elementType: 15 8 8 8 8 6 6 6 6 6 6 6 6 6 6 6 6 6 6 6 6 6 6 6 6 6 6 6 6 1 1 1 1 1 1 1 1 1 1 1 1 1 1 1 1 1 1 1 1 1 1 1 1 1 1 1
symmnumber: 1
zpe: 1169886.3 jmol-1
zpe.correction: 0.445586 hartree
zpe.thermalcorrener: 0.476887 hartree
zpe.thermalcorrenthalpy: 0.477832 hartree
zpe.thermalcorrgfe: 0.378169 hartree
zpe.sumelectzpe: -1570.782098 hartree
zpe.sumelectthermal: -1570.750797 hartree
zpe.sumelectthermalent: -1570.749853 hartree
zpe.sumelectthermalfe: -1570.849516 hartree
dipole: 0.2103 -0.5524 0.2861
dipole: 0.6567
quadrupole: -160.5265 -166.7427 -171.1763
quadrupole: -1.2965 -1.0325 1.0441
quadrupole: 5.6220 -0.5942 -5.0278 -1.2965 -1.0325 1.0441
hfenergy: -1571.2276845 hartree
pointgroup: C01 [X(C24H27O4P1)]
dipole: -0.1364515 0.1883204 0.1125389 debye
polarizability: 325.4709454|5.3931611|307.461647|6.1241617|-2.0950537|279.9774485 unknown
InChI: InChI=1S/C24H27O4P/c1-16-10-12-18(3)22(14-16)26-29(25,27-23-15-17(2)11-13-19(23)4)28-24-20(5)8-7-9-21(24)6/h7-15H,1-6H3
charge 0 multiplicity 1
56 atoms
P  0.140402 -0.10035 -0.14059
O  -0.572274 -1.451385 0.67731
O  -0.603202 1.196985 0.734312
O  1.716043 -0.064025 0.577521
O  0.068678 -0.060411 -1.726494
C  -0.477634 -2.804552 0.190191
C  -1.968364 1.577624 0.487394
C  2.688755 0.925817 0.192038
C  0.462396 -3.657309 0.822929
C  -1.403102 -3.239008 -0.792671
C  -2.880846 1.418978 1.5607
C  3.087144 1.854393 1.186283
C  -2.322617 2.144182 -0.750952
C  3.249643 0.884168 -1.097265
C  -3.650908 2.590682 -0.967726
C  4.268802 1.80387 -1.452119
C  0.482305 -5.012233 0.408055
C  -1.34367 -4.603861 -1.170648
C  -4.199923 1.878362 1.32801
C  4.112256 2.758291 0.815996
C  -4.581382 2.449786 0.091895
C  4.69137 2.73822 -0.474092
C  -0.407426 -5.482282 -0.582899
C  1.39025 -3.144435 1.905344
C  -2.412672 -2.291257 -1.408138
C  -2.455656 0.78393 2.867801
C  2.437583 1.871138 2.553747
C  -4.04785 3.213953 -2.294576
C  4.888345 1.770507 -2.838409
H  -1.567644 2.22795 -1.540563
H  2.885411 0.145746 -1.819958
H  1.200026 -5.697277 0.873801
H  -2.043099 -4.973134 -1.929348
H  -4.941114 1.777068 2.129546
H  4.454325 3.495363 1.55207
H  -5.614509 2.787513 -0.051068
H  5.478236 3.459435 -0.724206
H  -0.376505 -6.533249 -0.890666
H  2.078308 -3.939854 2.237381
H  1.985562 -2.282411 1.555821
H  0.816971 -2.790688 2.7824
H  -1.91302 -1.535151 -2.041915
H  -2.973355 -1.740057 -0.631136
H  -3.134847 -2.843168 -2.032692
H  -2.006799 -0.211247 2.695056
H  -1.686365 1.392863 3.377883
H  -3.31638 0.671367 3.54851
H  2.827135 2.703767 3.163458
H  1.340851 1.97734 2.466234
H  2.620992 0.925578 3.096688
H  -3.590742 4.21426 -2.419357
H  -3.712949 2.595336 -3.147024
H  -5.142036 3.335497 -2.370452
H  4.113047 1.79242 -3.626045
H  5.561048 2.630373 -2.999052
H  5.480603 0.848179 -2.991013
