program: Gaussian 09
title: 000012243
version: EM64L-G09RevD.01
frameworkgroup: C1[X(C6H12)]
method: RPBEPBE
basis: SDD
operation: Freq
keyword: #p
keyword: freq=noraman
keyword: PBEPBE/SDD
title: #p freq=noraman PBEPBE/SDD
converged: YES YES NO NO
title: Mulliken charges:
elementType: C C C C C C H H H H H H H H H H H H
charge: -0.426821 0.377965 -0.287255 -0.670492 -0.781580 -0.787925 0.203451 0.202829 0.207238 0.213131 0.210832 0.220908 0.214341 0.214560 0.226633 0.225373 0.219296 0.217516
chargesum: 0.00000
title: Mulliken charges with hydrogens summed into heavy atoms:
elementType: C C C C C C
charge: -0.020541 0.377965 -0.080018 -0.025621 -0.126046 -0.125739
polarizability: 8.80871146e+01 4.09712657e+00 6.16260284e+01 4.34214776e+00 1.20230073e+00 5.06523063e+01
1716.lowfreq: -13.7806 -10.5495 -8.1108 -0.0007 0.0005 0.0005 42.1648 122.1273 142.9261
frequency: 42.0472 122.1201 142.9240 196.1473 207.6034 296.4862 349.2223 397.4109 468.4646 499.4442 740.2779 813.7859 841.3388 908.4658 947.7305 993.4143 1012.8283 1060.1841 1072.2033 1081.7327 1136.0624 1218.0893 1256.0253 1303.1483 1358.4920 1384.2057 1387.9870 1397.8541 1454.9878 1459.4350 1469.9534 1472.1153 1474.4710 1477.0909 1484.7257 1696.3530 2955.5080 2961.8331 2963.8874 2975.2968 3026.2097 3029.8964 3033.6084 3063.0471 3072.5942 3078.3209 3081.4735 3093.1124
redmass: 2.1995 1.1097 1.6993 1.2190 1.1770 1.9569 2.4232 2.3519 2.1897 2.7438 1.6145 1.6545 1.2983 1.8788 1.4053 1.2517 1.9375 1.8275 1.5734 1.6458 2.1912 2.1850 1.2623 1.4456 1.4339 1.2036 1.3165 1.2301 1.0506 1.0654 1.0528 1.0478 1.0437 1.0772 1.0689 6.5080 1.0373 1.0450 1.0585 1.0355 1.0970 1.0964 1.0928 1.0919 1.0986 1.0977 1.0999 1.0955
irintensity: 0.1996 0.9072 1.1915 0.0992 0.0699 0.2403 1.5976 3.8066 2.8196 2.8705 7.9699 1.9302 17.7851 5.8107 0.2569 4.5149 2.3806 14.8920 6.4164 2.5667 4.8228 5.0715 3.6110 0.4253 0.7666 10.3862 27.9591 8.1484 2.2240 2.3298 12.6583 23.5524 14.6509 2.3278 15.2844 3.0596 38.2829 61.1692 38.3123 38.2258 5.3383 56.3862 6.0171 3.1120 55.1393 35.4424 84.1205 38.9811
temp: 298.150 k
press: 1.00000 atm
elementType: 6 6 6 6 6 6 1 1 1 1 1 1 1 1 1 1 1 1
symmnumber: 1
zpe: 424432.8 jmol-1
zpe.correction: 0.161658 hartree
zpe.thermalcorrener: 0.170006 hartree
zpe.thermalcorrenthalpy: 0.170951 hartree
zpe.thermalcorrgfe: 0.128999 hartree
zpe.sumelectzpe: -235.317969 hartree
zpe.sumelectthermal: -235.309621 hartree
zpe.sumelectthermalent: -235.308677 hartree
zpe.sumelectthermalfe: -235.350629 hartree
dipole: 0.1952 0.2062 0.0530
dipole: 0.2888
quadrupole: -37.7404 -38.2540 -40.6273
quadrupole: 0.1813 0.8297 0.2782
quadrupole: 1.1335 0.6199 -1.7534 0.1813 0.8297 0.2782
hfenergy: -235.4796274 hartree
pointgroup: C01 [X(C6H12)]
dipole: -0.0696859 0.0892306 0.0096397 debye
dipolederiv: -0.0152841 -0.0333628 0.0041751 0.0324178 0.1072325 -0.0350665 0.0199737 -0.0595174 0.1503883 0.2239249 -0.0153692 0.0672366 -0.0629436 0.2554403 0.1001175 0.0416589 0.0954094 -0.1043738 0.0252567 -0.0079098 0.0560719 0.1015913 0.0059992 0.0623087 0.1395177 0.0683191 -0.279977 -0.0053386 0.0101056 0.0506826 -0.0473899 0.1001641 -0.0069934 -0.0109627 0.0018006 0.0196253 -0.0649584 -0.0791416 -0.0436869 -0.0133996 -0.0281509 -0.041539 -0.0371634 -0.0467194 0.0971188 -0.0223758 0.0204228 -0.014626 -0.0161769 -0.1339931 -0.0640685 -0.0205129 -0.0602566 0.0954154 -0.0540546 0.0394794 -0.0695831 0.0191856 0.0387978 0.1173544 -0.0899831 0.0899404 -0.1144406 0.051383 0.0291403 0.0302085 -0.0195133 -0.1615959 -0.0903561 0.0282667 -0.0569989 0.0469172 0.0291801 0.0003002 -0.0175701 -0.0178696 -0.1584144 -0.0751163 -0.0409225 -0.0820691 0.1265056 -0.2288585 -0.068072 -0.0295182 -0.0977633 0.0665791 -0.0270463 -0.0459336 -0.0337471 0.0593927 0.0939982 -0.0054112 0.0165604 0.0554008 -0.167811 -0.0823869 0.0275796 -0.0463484 0.0554743 0.0758863 0.0492484 -0.068942 0.0295513 0.0260057 0.1098238 -0.0092421 0.0929263 -0.1044111 -0.1049064 -0.0092108 0.0989599 -0.010455 0.0960836 -0.0420218 0.1608863 -0.0066274 -0.0433893 -0.0193199 0.0218112 -0.0837001 0.0374754 0.0409157 0.1140741 -0.1523363 0.0738587 -0.071546 0.0736816 0.0770075 0.0110743 -0.0126059 -0.1560819 -0.0632314 -0.0089896 -0.0492428 0.0906699 -0.0648687 -0.1534397 -0.058468 -0.1012721 0.0149471 -0.0290035 -0.0471969 -0.0411968 0.0822202 -0.0303282 0.0478869 0.1378176 0.0360422 0.0508215 0.0022225 0.1529404 -0.0582145 -0.0455816 0.0369825 0.0765147 -0.0866926 0.0877249 0.0030608 0.0509289 -0.1075801 0.1186839 -0.0600083 unknown
polarizability: 87.3206991|-7.1622705|62.2115754|1.1497116|2.4999533|50.8331748 unknown
InChI: InChI=1S/C6H12/c1-4-5-6(2)3/h5H,4H2,1-3H3
charge 0 multiplicity 1
18 atoms
C  1.582114 0.004268 0.45523
C  -0.979346 0.082134 0.038922
C  0.222603 -0.562144 0.095251
C  2.615091 -0.178359 -0.688259
C  -2.244603 -0.665133 -0.357144
C  -1.190261 1.553222 0.354081
H  1.963892 -0.514077 1.359918
H  1.511658 1.075322 0.718852
H  0.23237 -1.634239 -0.162796
H  3.611016 0.198954 -0.390077
H  2.722651 -1.246152 -0.956215
H  2.295509 0.364767 -1.595858
H  -3.003752 -0.618814 0.449488
H  -2.710698 -0.212179 -1.255386
H  -2.041356 -1.72807 -0.575465
H  -0.256313 2.081613 0.605274
H  -1.887477 1.673415 1.207528
H  -1.655101 2.072872 -0.507541
