program: Gaussian 09
title: 000090566
version: EM64L-G09RevD.01
frameworkgroup: C1[X(C7H16N4O)]
method: RPBEPBE
basis: SDD
operation: Freq
keyword: #p
keyword: freq=noraman
keyword: PBEPBE/SDD
title: #p freq=noraman PBEPBE/SDD
converged: YES YES NO NO
title: Mulliken charges:
elementType: O N N N N C C C C C C C H H H H H H H H H H H H H H H H
charge: -0.234707 -0.056257 -0.068159 -0.374665 -0.502810 -0.349792 -0.354082 -0.382360 -0.377580 -0.430805 -0.614082 0.176557 0.220694 0.183123 0.184990 0.206599 0.205377 0.197133 0.193748 0.204939 0.238068 0.171240 0.221729 0.189470 0.222167 0.318905 0.304390 0.306169
chargesum: 0.00000
title: Mulliken charges with hydrogens summed into heavy atoms:
elementType: O N N N N C C C C C C C
charge: -0.234707 -0.056257 -0.068159 -0.055760 0.107750 0.054025 0.037507 0.020150 0.021107 -0.021496 0.019283 0.176557
polarizability: 1.31571407e+02 -4.64887921e+00 9.76573993e+01 -2.71558611e+00 -7.84047044e-01 9.04764213e+01
1716.lowfreq: -24.8240 -8.4510 0.0006 0.0007 0.0008 7.2126 17.3477 46.2625 69.5067
frequency: 12.2545 46.0534 69.4408 117.9402 126.8830 199.5789 213.0630 221.2282 238.6733 262.6630 282.7469 313.3069 349.8993 377.3523 387.0128 441.7386 483.3725 548.1682 599.0676 638.6767 733.6541 755.8846 773.9154 798.0100 850.2638 909.6370 945.9382 967.1119 1008.6864 1022.9196 1050.9546 1070.5010 1079.5022 1110.9373 1131.1950 1145.2861 1147.1041 1156.1884 1194.8433 1198.3432 1238.4514 1273.5221 1280.3019 1285.3623 1295.4722 1307.3092 1335.8594 1345.6038 1363.9500 1373.0711 1393.4298 1430.2287 1432.8223 1446.9523 1452.1991 1453.5863 1459.6785 1465.4663 1473.9870 1481.7300 1631.1029 1680.0038 2793.0121 2845.1630 2851.9314 2859.4229 2863.8348 2877.5526 3018.0974 3024.7531 3025.7497 3028.4913 3031.3201 3037.3530 3075.9992 3389.7222 3503.7903 3543.5024
redmass: 5.2955 3.3967 4.0718 1.9747 1.8331 2.4696 3.0361 1.2466 2.3254 2.6326 2.3152 2.2112 2.7059 3.0751 1.9066 4.1823 2.8140 1.8659 1.5785 2.2305 4.4150 3.3580 1.8701 3.3686 1.5210 2.3431 4.2097 1.8894 2.4037 2.4492 1.6035 1.6973 1.7340 1.9711 2.0436 2.7682 2.9260 2.8708 1.4136 1.1197 2.2852 1.8776 1.4916 1.1899 1.5090 1.2985 1.3130 1.3369 1.4675 1.4132 1.4746 1.1701 1.5721 1.1335 1.0776 1.0826 1.0689 1.1003 1.1069 1.0527 7.6738 1.0648 1.0710 1.0709 1.0631 1.0652 1.0699 1.0659 1.0731 1.0855 1.0896 1.0881 1.0900 1.0882 1.1009 1.0428 1.0985 1.0794
irintensity: 1.5241 0.3839 3.9496 8.5049 12.5491 9.3880 1.0477 0.6393 3.1575 7.2067 7.2740 15.9386 3.9665 14.6006 0.3515 4.4029 0.2650 96.8675 61.5282 12.8682 0.4125 5.3106 136.2500 24.4752 0.0516 13.0421 11.4843 1.6738 39.0345 1.2864 3.6305 5.0217 1.4536 35.3493 3.4451 40.9521 17.2023 32.1320 2.0700 3.9545 25.7173 2.4046 14.5135 3.4934 42.5067 0.6876 4.7279 4.7169 2.2225 5.6997 0.8491 1.7468 131.1955 14.5201 0.3934 2.9080 29.2330 28.6283 7.3144 9.0550 162.6840 26.5474 117.7857 87.6015 66.0165 41.3570 16.1084 314.4321 45.7043 7.2446 18.9829 96.2104 51.4058 16.3511 35.9479 0.1090 1.6377 23.8567
temp: 298.150 k
press: 1.00000 atm
elementType: 8 7 7 7 7 6 6 6 6 6 6 6 1 1 1 1 1 1 1 1 1 1 1 1 1 1 1 1
symmnumber: 1
zpe: 631926.0 jmol-1
zpe.correction: 0.240688 hartree
zpe.thermalcorrener: 0.253955 hartree
zpe.thermalcorrenthalpy: 0.254899 hartree
zpe.thermalcorrgfe: 0.199488 hartree
zpe.sumelectzpe: -569.538280 hartree
zpe.sumelectthermal: -569.525013 hartree
zpe.sumelectthermalent: -569.524069 hartree
zpe.sumelectthermalfe: -569.579480 hartree
dipole: -0.6717 0.2977 -2.2271
dipole: 2.3452
quadrupole: -68.8850 -67.7735 -80.7161
quadrupole: 0.7862 -5.2659 -2.9658
quadrupole: 3.5732 4.6847 -8.2579 0.7862 -5.2659 -2.9658
hfenergy: -569.7789679 hartree
pointgroup: C01 [X(C7H16N4O1)]
dipole: 0.2898997 -0.2748782 -0.8316849 debye
polarizability: 131.4867808|-3.4960082|97.5721628|4.5888984|-0.6239314|90.6462836 unknown
InChI: InChI=1S/C7H16N4O/c1-10-2-4-11(5-3-10)6-7(12)9-8/h9H,2-6,8H2,1H3
charge 0 multiplicity 1
28 atoms
O  -2.560179 0.081081 1.406523
N  0.131903 -0.625942 0.139317
N  2.829271 0.303853 -0.326957
N  -3.225368 -0.03311 -0.814519
N  -4.399559 0.74835 -0.640918
C  0.386418 0.634977 -0.595849
C  1.251146 -1.583103 -0.030738
C  1.712791 1.260317 -0.135418
C  2.571505 -0.944224 0.429633
C  -1.170996 -1.22953 -0.183057
C  4.139882 0.897496 0.000221
C  -2.354608 -0.335377 0.231679
H  -0.437871 1.341647 -0.388559
H  0.432716 0.461329 -1.70208
H  1.362704 -1.903138 -1.09861
H  1.044028 -2.482539 0.579447
H  1.917483 2.168808 -0.732577
H  1.610472 1.564514 0.937219
H  2.512344 -0.752786 1.531421
H  3.403781 -1.649771 0.246872
H  -1.266054 -2.174464 0.384992
H  -1.264134 -1.489985 -1.273852
H  4.942553 0.169285 -0.215525
H  4.231606 1.206103 1.072824
H  4.310993 1.790411 -0.627736
H  -3.032346 -0.332697 -1.771688
H  -5.063905 0.260871 -0.022213
H  -4.157475 1.666923 -0.241351
