program: Gaussian 09
title: 000090542
version: EM64L-G09RevD.01
frameworkgroup: C1[X(C9H18N2O)]
method: RPBEPBE
basis: SDD
operation: Freq
keyword: #p
keyword: freq=noraman
keyword: PBEPBE/SDD
title: #p freq=noraman PBEPBE/SDD
converged: YES YES NO NO
title: Mulliken charges:
elementType: O N N C C C C C C C C C H H H H H H H H H H H H H H H H H H
charge: -0.285962 -0.102809 -0.570194 -0.386830 -0.366836 -0.398141 -0.388610 -0.478724 -0.391570 0.179273 -0.331385 -0.382085 0.211895 0.216511 0.195884 0.213277 0.191754 0.210581 0.209358 0.213269 0.197303 0.243337 0.258073 0.198239 0.173636 0.248791 0.217907 0.170746 0.275806 0.257505
chargesum: 0.00000
title: Mulliken charges with hydrogens summed into heavy atoms:
elementType: O N N C C C C C C C C C
charge: -0.285962 -0.102809 -0.036883 0.041577 0.042325 0.004193 0.034018 -0.038084 0.064742 0.179273 0.091043 0.006567
polarizability: 1.34033568e+02 -1.54062608e-01 1.10992880e+02 -2.55053660e+00 -2.04544983e+00 8.95085795e+01
1716.lowfreq: -7.8538 -0.0005 -0.0002 0.0006 5.3714 9.7294 36.5195 50.5883 65.8157
frequency: 36.0781 50.5471 65.7732 92.5241 122.3126 152.9939 202.2520 221.6848 231.4479 260.9268 317.7497 359.9831 370.7141 408.5153 447.6479 478.2025 516.9554 561.8234 574.3858 669.8333 704.5990 759.7961 807.3078 828.6280 836.1804 861.4486 888.6108 935.6798 967.4200 970.6687 1006.4237 1030.1060 1047.5526 1078.7491 1085.6201 1103.7043 1115.7629 1129.8172 1159.8814 1192.2938 1216.3838 1228.1325 1240.9191 1255.2178 1281.7351 1288.4643 1295.8644 1302.8544 1316.4204 1339.4559 1342.4007 1351.8940 1359.4449 1371.2249 1390.3087 1417.5038 1452.2198 1453.3362 1459.9989 1465.0849 1470.1458 1470.4430 1489.0116 1493.5169 1586.9971 1637.6366 2849.9992 2959.2210 2962.0020 2971.4013 2974.4644 2975.2530 2978.8416 2981.7937 3018.2254 3021.9972 3034.6882 3043.8737 3053.1120 3056.6999 3075.8985 3080.6200 3460.4084 3589.3704
redmass: 4.2932 3.2903 1.7777 3.9977 2.5514 3.2203 2.2578 1.3436 2.6578 2.2118 2.2345 3.2053 3.3017 2.3523 2.5852 1.7145 3.2143 3.1509 1.3045 4.0444 3.0879 1.1117 2.7490 1.6431 1.5127 1.5480 2.0284 1.8975 1.8270 2.2541 2.6350 2.0592 2.8953 1.8071 2.2059 2.1054 2.1923 1.7080 1.3605 1.7036 1.5884 1.5711 1.5221 1.2808 1.2463 1.0833 1.3439 1.2494 1.3688 1.3303 1.3987 1.4607 1.4329 1.3370 1.4333 2.1517 1.0887 1.0884 1.1092 1.0896 1.0911 1.0911 1.1650 1.0915 6.4052 1.0949 1.0717 1.0624 1.0672 1.0662 1.0634 1.0655 1.0672 1.0615 1.0858 1.0960 1.1019 1.1019 1.0964 1.0923 1.1002 1.0948 1.0448 1.0979
irintensity: 0.3740 1.0985 4.1556 2.3106 1.2644 1.2824 3.1039 39.1899 14.6930 5.4177 3.0893 2.5939 1.2954 3.0295 30.8576 8.3966 14.8403 2.4714 211.8915 1.9219 2.9234 6.5073 1.2625 3.7202 4.8831 4.2370 7.9793 2.0333 7.8832 19.0605 0.5655 0.9112 0.8605 10.4339 3.7931 17.8154 15.3304 8.5778 26.8080 39.4900 10.3676 9.9316 4.2642 12.4813 5.7838 4.6801 27.4400 7.7017 11.7613 3.5294 6.6835 3.8118 1.3606 4.8519 21.7073 58.8581 17.0999 7.9773 19.2614 17.3268 15.7516 10.1624 18.1048 7.0291 249.4518 41.0668 123.1345 28.5312 18.9212 49.8252 3.8276 65.3440 14.0740 38.3564 35.3214 64.4406 23.0741 80.7319 43.4961 5.7160 29.1033 16.6607 1.3838 0.2656
temp: 298.150 k
press: 1.00000 atm
elementType: 8 7 7 6 6 6 6 6 6 6 6 6 1 1 1 1 1 1 1 1 1 1 1 1 1 1 1 1 1 1
symmnumber: 1
zpe: 698123.2 jmol-1
zpe.correction: 0.265901 hartree
zpe.thermalcorrener: 0.279125 hartree
zpe.thermalcorrenthalpy: 0.280069 hartree
zpe.thermalcorrgfe: 0.225433 hartree
zpe.sumelectzpe: -537.505254 hartree
zpe.sumelectthermal: -537.492031 hartree
zpe.sumelectthermalent: -537.491087 hartree
zpe.sumelectthermalfe: -537.545722 hartree
dipole: -0.4227 -5.1030 0.0914
dipole: 5.1213
quadrupole: -62.3402 -82.0796 -74.4443
quadrupole: -4.1839 -4.9996 0.0185
quadrupole: 10.6145 -9.1249 -1.4896 -4.1839 -4.9996 0.0185
hfenergy: -537.7711554 hartree
pointgroup: C01 [X(C9H18N2O1)]
dipole: 0.2024184 -1.9964736 -0.1811741 debye
polarizability: 134.0243182|0.7509745|110.6031607|-2.5065168|3.5348806|89.9075489 unknown
InChI: InChI=1S/C9H18N2O/c10-6-4-8-11-7-3-1-2-5-9(11)12/h1-8,10H2
charge 0 multiplicity 1
30 atoms
O  0.22214 2.235511 0.527006
N  0.105541 -0.048091 0.088483
N  -4.849558 -0.353931 -0.570169
C  0.675744 -1.290258 -0.48215
C  1.922837 -1.822934 0.266856
C  3.233564 -1.088821 -0.098014
C  3.229371 0.433817 0.17559
C  2.142154 1.225836 -0.604813
C  -1.225102 -0.129674 0.73382
C  0.750679 1.184062 0.038276
C  -2.391053 -0.164064 -0.280433
C  -3.760269 -0.277492 0.421636
H  0.923201 -1.144395 -1.553503
H  -0.123795 -2.051295 -0.445015
H  2.0413 -2.897795 0.021854
H  1.734701 -1.759818 1.356836
H  3.442109 -1.253413 -1.176486
H  4.073194 -1.552381 0.456656
H  4.220268 0.839288 -0.107462
H  3.109473 0.626767 1.259905
H  2.100855 0.859651 -1.65115
H  2.409953 2.294772 -0.639887
H  -1.323036 0.760682 1.37921
H  -1.251217 -1.032954 1.377399
H  -2.265007 -1.024245 -0.97263
H  -2.378382 0.753399 -0.894915
H  -3.921941 0.628138 1.037261
H  -3.730776 -1.144972 1.129821
H  -5.789151 -0.213258 -0.188706
H  -4.800198 -1.172332 -1.184876
