program: Gaussian 09
title: 000090519
version: EM64L-G09RevD.01
frameworkgroup: C1[X(C8H18OS)]
method: RPBEPBE
basis: SDD
operation: Freq
keyword: #p
keyword: freq=noraman
keyword: PBEPBE/SDD
title: #p freq=noraman PBEPBE/SDD
converged: YES YES NO NO
title: Mulliken charges:
elementType: S O C C C C C C C C H H H H H H H H H H H H H H H H H H
charge: 0.179576 -0.449982 -0.354889 -0.346993 -0.334456 -0.354431 -0.695631 -0.694580 -0.598955 -0.283811 0.185452 0.187622 0.188007 0.188881 0.208999 0.212087 0.194552 0.193658 0.248285 0.242436 0.209979 0.210603 0.215309 0.270416 0.229460 0.205504 0.195455 0.347450
chargesum: 0.00000
title: Mulliken charges with hydrogens summed into heavy atoms:
elementType: S O C C C C C C C C
charge: 0.179576 -0.102532 0.018186 0.029894 0.086629 0.033779 -0.204909 -0.058689 -0.099080 0.117147
polarizability: 1.55935066e+02 3.42954234e-01 9.55358543e+01 1.53430476e+00 -4.69951924e-01 8.25385796e+01
1716.lowfreq: -43.2669 -10.9006 -4.9738 -0.0020 -0.0013 0.0005 10.5065 20.9186 42.7256
frequency: -20.6475 18.1187 42.6481 48.6349 69.8463 100.7055 116.1426 125.3543 144.1844 206.0155 225.5857 230.8983 266.5647 293.2535 410.5019 427.4785 449.9291 638.9665 709.8436 723.0472 742.2693 786.0703 830.5624 869.6880 888.8207 948.8047 968.6932 1001.6040 1005.0267 1025.6775 1040.2970 1058.5552 1067.8137 1079.7926 1114.7499 1142.8516 1189.5970 1196.2125 1217.8416 1237.1507 1252.1127 1263.6663 1277.2234 1285.4074 1293.4169 1294.8253 1314.9941 1345.9707 1350.7077 1386.8326 1402.9660 1429.4693 1451.5075 1462.9713 1464.4849 1468.5120 1472.7995 1476.9876 1481.8255 1487.6365 2929.2826 2952.0345 2956.2888 2966.3514 2971.3953 2977.0246 2988.6097 2991.5382 2993.5587 3004.0166 3016.9709 3024.7613 3038.7014 3066.7610 3068.4074 3070.7081 3090.8455 3576.9629
redmass: 1.9370 5.0705 4.1406 3.5038 2.0266 4.1228 2.2994 2.0198 4.0830 3.4677 1.3161 1.1046 2.3927 2.7469 3.2039 3.0013 2.8595 4.3521 5.2912 1.0671 1.0924 1.1602 2.1216 1.2209 1.8983 2.2760 1.1926 1.5985 3.7029 3.2987 2.5845 1.1098 2.7587 2.2190 2.4058 1.1369 1.7020 1.1106 1.2265 1.3564 1.2886 1.2307 1.1483 1.0759 1.1637 1.1737 1.3308 1.4816 1.6595 1.2151 1.4114 1.1024 1.0890 1.0656 1.0745 1.0791 1.0738 1.0439 1.0790 1.0876 1.0588 1.0586 1.0587 1.0591 1.0362 1.0588 1.0976 1.0562 1.0991 1.1011 1.0610 1.1034 1.1048 1.1057 1.1033 1.0993 1.1066 1.0666
irintensity: 1.6205 1.8612 0.5052 1.6608 0.1747 1.0286 0.9239 0.0720 2.4690 10.4858 131.4209 0.0016 17.6452 12.5476 2.5102 5.4776 9.7949 4.0813 4.3208 12.2721 1.3201 5.2573 12.1016 0.3282 4.0501 12.8580 1.1113 15.5244 1.1556 14.8707 64.4740 0.6534 1.0735 1.0435 10.1574 3.6944 0.4020 3.4455 10.0891 0.6250 34.6190 13.7326 0.3589 0.1107 6.7991 9.9991 3.8392 2.2574 1.2071 11.1129 1.9522 12.9822 2.6203 0.4900 0.1567 7.4493 1.0511 12.1028 3.1391 21.8208 82.2660 0.6048 7.9272 76.5230 36.4046 30.9167 0.6504 59.0282 37.7074 0.3441 42.6544 11.6249 48.6315 2.4156 166.5071 54.6273 19.1914 4.4083
temp: 298.150 k
press: 1.00000 atm
elementType: 16 8 6 6 6 6 6 6 6 6 1 1 1 1 1 1 1 1 1 1 1 1 1 1 1 1 1 1
symmnumber: 1
zpe: 646033.3 jmol-1
zpe.correction: 0.246061 hartree
zpe.thermalcorrener: 0.259688 hartree
zpe.thermalcorrenthalpy: 0.260633 hartree
zpe.thermalcorrgfe: 0.203292 hartree
zpe.sumelectzpe: -788.059711 hartree
zpe.sumelectthermal: -788.046083 hartree
zpe.sumelectthermalent: -788.045139 hartree
zpe.sumelectthermalfe: -788.102480 hartree
dipole: 0.2989 2.1973 1.5950
dipole: 2.7316
quadrupole: -59.9030 -71.4696 -72.0112
quadrupole: 4.3565 9.0792 -1.3634
quadrupole: 7.8916 -3.6750 -4.2166 4.3565 9.0792 -1.3634
hfenergy: -788.3057718 hartree
pointgroup: C01 [X(C8H18O1S1)]
dipole: 0.1257332 -0.9487287 -0.4889363 debye
polarizability: 155.9468361|-0.1206009|95.0913591|-1.2679317|-2.4065008|82.9713049 unknown
InChI: InChI=1S/C8H18OS/c1-2-3-4-5-7-10-8-6-9/h9H,2-8H2,1H3
charge 0 multiplicity 1
28 atoms
S  2.168785 0.604237 -0.00894
O  5.31449 0.857577 0.192535
C  -1.934933 -0.458624 0.177669
C  -3.212408 0.368009 -0.094456
C  -0.636338 0.356552 -0.031744
C  -4.516115 -0.431558 0.129591
C  0.628663 -0.482469 0.216367
C  -5.787507 0.400009 -0.146407
C  3.490406 -0.707719 0.354083
C  4.785897 -0.388192 -0.383472
H  -1.925928 -1.347946 -0.487025
H  -1.963575 -0.845349 1.217807
H  -3.189962 0.74608 -1.137933
H  -3.216317 1.264313 0.560536
H  -0.61422 0.759628 -1.064051
H  -0.635783 1.230207 0.650378
H  -4.537928 -0.807526 1.173003
H  -4.51075 -1.328384 -0.523495
H  0.636268 -0.883519 1.246245
H  0.691194 -1.324973 -0.49745
H  -5.803538 0.764744 -1.190946
H  -5.834709 1.28422 0.517121
H  -6.704896 -0.194821 0.017897
H  3.669862 -0.74867 1.4415
H  3.098962 -1.681688 0.008696
H  4.582928 -0.280116 -1.469655
H  5.505947 -1.223507 -0.232715
H  6.062904 1.191887 -0.362042
