program: Gaussian 09
title: 000090551
version: EM64L-G09RevD.01
frameworkgroup: C1[X(C6H11O6P)]
method: RPBEPBE
basis: SDD
operation: Freq
keyword: #p
keyword: freq=noraman
keyword: PBEPBE/SDD
title: #p freq=noraman PBEPBE/SDD
converged: YES YES NO NO
title: Mulliken charges:
elementType: P O O O O O O C C C C C C H H H H H H H H H H H
charge: 1.389379 -0.516484 -0.272807 -0.685562 -0.674658 -0.581153 -0.248910 -0.251454 -0.244395 0.173810 0.341521 -0.757798 -0.626564 0.239787 0.242735 0.230092 0.256473 0.237324 0.243964 0.216639 0.230258 0.255746 0.405121 0.396934
chargesum: 0.00000
title: Mulliken charges with hydrogens summed into heavy atoms:
elementType: P O O O O O O C C C C C C
charge: 1.389379 -0.516484 -0.272807 -0.280441 -0.277724 -0.581153 -0.248910 0.231068 0.242170 0.173810 0.341521 -0.059870 -0.140560
polarizability: 1.45260840e+02 1.12446526e+00 1.06291262e+02 4.27546246e+00 1.45819048e+00 7.79653570e+01
1716.lowfreq: -3.2020 -0.0013 0.0001 0.0009 1.3797 4.9220 13.9113 20.8818 26.7463
frequency: 13.8608 20.8255 26.7425 67.1774 78.4027 113.8233 141.4441 154.3299 176.3385 178.2512 239.7540 244.4457 284.1429 296.7542 331.4111 350.1731 356.8826 370.7540 386.0655 394.3473 459.3263 484.2978 579.0895 622.3959 633.0970 712.7060 723.9147 782.8864 788.2358 863.2948 889.7888 948.4758 991.8117 995.8630 1004.5271 1009.5275 1015.8961 1029.5846 1055.5716 1091.1728 1109.8445 1115.4202 1202.4711 1248.6731 1288.2403 1352.3428 1380.8394 1396.6698 1416.0722 1448.3192 1456.9379 1458.9051 1472.6824 1611.2230 1654.2342 2989.7183 3011.3888 3018.3767 3073.7816 3081.7600 3090.7986 3098.4693 3104.8957 3217.0657 3594.0371 3613.7072
redmass: 5.6805 4.7804 6.0317 4.4803 5.5557 6.7931 2.9278 5.3247 1.4836 1.0933 3.1561 2.4291 3.3231 2.7559 6.3493 5.2020 2.0842 2.5088 3.2323 3.6502 4.7353 3.8840 3.7538 6.5157 1.5958 6.0436 10.6359 2.3415 3.2266 3.8584 3.8294 1.9380 1.3227 2.4967 1.3457 1.4246 1.2558 2.2523 1.4991 6.0604 2.4650 5.4737 1.0857 1.1081 3.2858 1.3216 1.5088 1.1677 1.2500 1.0776 1.0477 1.0869 1.0609 11.2818 5.1894 1.0360 1.0566 1.0603 1.0972 1.1053 1.1073 1.1009 1.0618 1.1157 1.0662 1.0665
irintensity: 0.6788 1.1586 1.2013 1.9085 3.7721 1.9332 13.5550 1.7653 91.0676 1.4692 23.2922 11.2849 7.1993 22.3295 85.8647 53.7779 53.5293 16.8950 89.0762 4.4098 10.7454 0.1260 1.6492 20.3130 5.4937 186.8661 242.0037 7.4008 4.6396 6.8939 190.1018 15.1916 53.4677 58.7379 29.9178 21.7183 117.1172 32.9202 7.0121 248.4704 9.7860 400.3823 6.8372 6.7562 106.5196 0.4606 4.5836 20.3231 11.0125 13.4649 12.2027 28.0299 34.2855 152.1418 3.8154 15.4618 6.4524 27.1025 15.3775 12.2233 17.3094 24.7680 4.8461 5.0967 58.2302 72.4535
temp: 298.150 k
press: 1.00000 atm
elementType: 15 8 8 8 8 8 8 6 6 6 6 6 6 1 1 1 1 1 1 1 1 1 1 1
symmnumber: 1
zpe: 457058.8 jmol-1
zpe.correction: 0.174085 hartree
zpe.thermalcorrener: 0.190234 hartree
zpe.thermalcorrenthalpy: 0.191178 hartree
zpe.thermalcorrgfe: 0.127388 hartree
zpe.sumelectzpe: -1026.742929 hartree
zpe.sumelectthermal: -1026.726780 hartree
zpe.sumelectthermalent: -1026.725835 hartree
zpe.sumelectthermalfe: -1026.789625 hartree
dipole: -0.1690 1.6154 -3.8733
dipole: 4.2000
quadrupole: -81.6346 -77.8292 -91.0918
quadrupole: 10.4055 10.2157 -0.5564
quadrupole: 1.8839 5.6893 -7.5733 10.4055 10.2157 -0.5564
hfenergy: -1026.9170133 hartree
pointgroup: C01 [X(C6H11O6P1)]
dipole: -0.0921672 0.4839584 -1.5772736 debye
dipolederiv: 2.4102089 -0.1951659 -0.1350454 -0.1299542 1.9972078 0.0641673 0.1181066 -0.232086 1.7383223 -1.2010882 0.4277835 0.1851495 0.5555597 -0.8648662 -0.1233897 0.3487337 -0.1961615 -0.5403199 -1.6828565 -0.2445245 -0.157679 -0.3120396 -0.5254962 0.0214341 -0.2069899 0.0292781 -0.2974454 -0.9129706 -0.2457886 -0.0296947 -0.3618509 -0.6864485 -0.1879727 -0.148098 -0.1651756 -0.7399314 -0.7863252 0.0329107 0.086875 0.1006568 -0.7528934 0.3054776 0.0515126 0.4312558 -0.7972932 -0.7104447 0.0284691 0.0483423 0.0804249 -0.6405727 -0.0485364 0.0260281 0.0068945 -0.6449632 -0.7321528 0.021349 -0.0602515 0.1640684 -0.8719436 0.1808989 -0.1335482 0.153799 -0.3791497 0.5403052 -0.180588 -0.1300406 -0.3651783 0.522942 0.1060019 -0.5055173 0.2702189 0.3227527 0.6066407 0.2446176 -0.0093309 0.52203 0.3692516 0.0293558 0.0049306 -0.0069661 0.2792851 1.9371351 0.2548657 0.1896122 0.1964628 1.0505327 -0.2028786 0.2711698 -0.1821514 0.3207001 -0.2084625 -0.3554977 0.0703676 -0.3487132 0.0000863 -0.0669497 0.0667043 -0.0668752 -0.0213457 -0.0847799 0.0954114 -0.0438033 0.0839915 -0.0516931 0.0460094 -0.0469038 0.0431231 0.0497853 -0.0448702 0.1673639 0.0035424 -0.027492 -0.0312176 -0.07743 0.0600792 -0.0472914 -0.3050442 -0.0371582 -0.0720944 0.0034527 0.003657 -0.0874679 -0.0484849 0.0776082 -0.0353252 0.0740264 0.0714613 0.0255072 0.0147422 0.0673916 0.0239229 0.0784322 0.077557 -0.0032198 -0.0626654 -0.0499299 0.0563075 0.0479591 -0.0825865 -0.0469289 -0.0656701 0.0336871 -0.0780339 0.03545 0.0298664 -0.0417568 -0.0123652 -0.131298 0.0418405 0.0060071 0.019884 0.053274 -0.0531773 0.0667061 0.0119891 -0.0996296 0.02207 0.0781769 -0.0544612 -0.1129889 -0.0169436 -0.0566954 0.0012061 0.0644634 0.0933806 0.0711184 0.0867072 0.0064529 0.1061275 -0.027156 0.0037439 -0.0135317 -0.1521408 0.0208437 -0.0768379 -0.0868909 0.0400001 -0.0002975 0.0257027 0.1051319 0.0533571 -0.0653317 -0.0014874 -0.0994263 -0.042322 0.0394871 0.0047809 0.0432811 0.159052 0.0935267 0.0475564 -0.030351 0.0700221 0.0173511 0.0563611 -0.0361243 0.052827 0.1740283 0.26492 0.1379486 -0.0427747 0.081007 0.2740621 0.0224039 -0.0761442 0.0249487 0.3718173 0.3892369 -0.0636546 -0.0118141 -0.0830834 0.2266596 -0.1267161 -0.0002973 -0.0772172 0.2639355 unknown
polarizability: 145.3064023|2.0246264|106.3530169|3.3357846|-1.2726698|77.8580406 unknown
InChI: InChI=1S/C6H11O6P/c1-5(2)6(7)11-3-4-12-13(8,9)10/h8-9H,1,3-4H2,2H3
charge 0 multiplicity 1
24 atoms
P  -3.264147 0.317138 0.270499
O  -1.811262 -0.500383 0.617943
O  1.033995 -0.386485 -0.171058
O  -4.143857 -0.968115 -0.449079
O  -2.982746 1.257593 -1.162262
O  -3.869931 1.112341 1.492727
O  2.930527 -1.55782 0.504931
C  -1.167177 -1.363526 -0.415064
C  0.247373 -1.623267 0.058251
C  2.405697 -0.486123 0.11362
C  3.100344 0.822979 -0.116272
C  2.281585 2.018445 -0.557157
C  4.445155 0.85634 0.095719
H  -1.736508 -2.307574 -0.479222
H  -1.176017 -0.852888 -1.395169
H  0.70269 -2.456232 -0.509726
H  0.271161 -1.878471 1.132001
H  1.770203 1.817158 -1.515624
H  1.490956 2.246536 0.179978
H  2.923113 2.907655 -0.677303
H  5.022317 1.776073 -0.047314
H  4.980106 -0.04345 0.418639
H  -5.006877 -0.722999 -0.866407
H  -2.736498 2.201177 -0.984148
