program: Gaussian 09
title: 000126750
version: EM64L-G09RevD.01
frameworkgroup: C1[X(C11H13NO3)]
method: RPBEPBE
basis: SDD
operation: Freq
keyword: #p
keyword: freq=noraman
keyword: PBEPBE/SDD
title: #p freq=noraman PBEPBE/SDD
converged: YES YES NO NO
title: Mulliken charges:
elementType: O O O N C C C C C C C C C C C H H H H H H H H H H H H H
charge: -0.431033 -0.281264 -0.249648 0.002620 -0.276248 -0.121732 -0.583408 0.304988 0.209324 -0.718096 0.097277 -0.505522 -0.430035 0.157787 -0.501262 0.262837 0.240731 0.249958 0.285597 0.225579 0.228581 0.226426 0.264600 0.334813 0.283353 0.243713 0.243552 0.236510
chargesum: 0.00000
title: Mulliken charges with hydrogens summed into heavy atoms:
elementType: O O O N C C C C C C C C C C C
charge: -0.096220 -0.281264 -0.249648 0.002620 -0.013411 0.118999 -0.047853 0.304988 0.209324 -0.037510 0.097277 -0.240922 -0.146682 0.157787 0.222513
polarizability: 1.75416631e+02 2.85133745e+00 1.36633542e+02 3.47107953e+00 -8.37445510e+00 8.53043112e+01
1716.lowfreq: -12.2040 -5.2331 0.0005 0.0006 0.0008 11.5723 39.7089 57.8459 77.0359
frequency: 39.6152 57.8042 77.0055 105.8253 122.4124 128.7177 162.5591 210.4164 215.1491 229.7373 259.5096 297.3660 313.1523 325.0281 359.6963 402.7898 445.4014 460.8129 488.7364 556.3394 580.1310 621.1721 707.1939 716.4628 742.4191 752.7824 804.0882 837.2178 845.3920 884.0092 912.9715 951.0387 954.9116 968.8382 1001.5087 1026.1725 1072.4618 1084.7939 1109.1871 1111.9915 1114.1262 1142.1323 1149.7064 1180.2874 1199.6006 1245.6509 1256.1894 1272.9857 1278.0981 1295.8860 1310.9014 1328.4451 1377.8649 1389.1344 1405.4115 1424.3683 1427.3331 1448.0150 1453.3301 1462.8697 1474.7740 1477.5923 1561.1941 1575.9812 1614.9375 2979.5745 3003.8048 3006.2241 3020.1928 3078.3922 3080.6365 3082.2051 3089.8987 3108.4831 3126.2948 3151.7259 3168.0208 3541.6689
redmass: 6.0227 3.7172 3.8289 1.2748 4.1313 2.7600 3.4649 2.7934 2.1148 1.4251 3.4666 3.8007 1.1202 4.4120 5.3082 5.7837 2.5943 4.6911 4.3753 6.0809 5.4907 4.9954 4.5721 5.2436 4.3249 3.0404 3.9208 3.3479 5.1556 2.0700 1.5686 3.2114 1.5280 2.4048 2.7945 2.4395 2.2698 1.7533 2.6810 2.8087 1.2656 1.4106 1.5077 1.8528 2.4603 1.3857 2.0799 2.2482 2.0983 1.3940 1.9754 2.7145 1.1709 1.2128 2.2362 1.2547 1.2701 1.9656 1.0498 1.0521 1.0505 1.0633 6.8168 8.3721 9.9287 1.0349 1.0681 1.0296 1.0852 1.0993 1.0985 1.0948 1.0901 1.1046 1.0920 1.1048 1.0923 1.0660
irintensity: 1.1256 1.3981 2.4289 1.5513 1.0835 1.2045 4.0441 0.4951 2.2682 1.5066 6.7710 1.0667 101.2762 13.7529 6.9922 4.4545 0.2890 10.7664 13.9275 0.6045 2.2773 2.2478 0.7556 1.2860 9.6809 18.2330 15.0661 15.6027 14.1032 6.0461 11.6439 22.4990 3.4889 3.2802 63.8192 50.6110 2.6970 14.2685 194.6903 16.1647 0.1327 28.3683 62.5435 14.6341 69.9766 10.2287 64.4418 101.4046 19.4427 0.7306 2.9230 0.5309 17.8902 22.7976 15.6684 23.6847 17.1027 34.6998 14.9831 11.7472 15.1758 13.4224 14.2716 22.2613 187.9226 28.9719 6.5417 35.8456 8.1042 33.4868 10.2966 9.4415 44.6874 25.1659 17.6849 15.0449 1.8061 7.4834
temp: 298.150 k
press: 1.00000 atm
elementType: 8 8 8 7 6 6 6 6 6 6 6 6 6 6 6 1 1 1 1 1 1 1 1 1 1 1 1 1
symmnumber: 1
zpe: 581664.8 jmol-1
zpe.correction: 0.221544 hartree
zpe.thermalcorrener: 0.236045 hartree
zpe.thermalcorrenthalpy: 0.236989 hartree
zpe.thermalcorrgfe: 0.179740 hartree
zpe.sumelectzpe: -706.275729 hartree
zpe.sumelectthermal: -706.261228 hartree
zpe.sumelectthermalent: -706.260284 hartree
zpe.sumelectthermalfe: -706.317534 hartree
dipole: -0.7890 -0.0053 1.0201
dipole: 1.2896
quadrupole: -72.4489 -103.4707 -86.9033
quadrupole: 6.8075 4.6470 -1.1447
quadrupole: 15.1587 -15.8631 0.7043 6.8075 4.6470 -1.1447
hfenergy: -706.4972737 hartree
pointgroup: C01 [X(C11H13N1O3)]
dipole: -0.3142878 -0.0043596 0.3982716 debye
polarizability: 175.4074831|2.3848578|136.8152936|4.2800935|-7.6004569|85.1317068 unknown
InChI: InChI=1S/C11H13NO3/c1-6-8-4-12-5-9(11(14)15-2)7(8)3-10(6)13/h4-6,10,13H,3H2,1-2H3
charge 0 multiplicity 1
28 atoms
O  2.517584 -1.952833 -1.548927
O  -3.383338 0.191187 -0.121397
O  -2.161381 -1.731588 0.360095
N  -0.072501 2.627014 -0.44137
C  2.737032 -0.02501 0.053246
C  2.306341 -1.51677 -0.155902
C  0.800258 -1.577719 0.2391
C  1.420644 0.724547 -0.118001
C  0.313821 -0.156438 0.017583
C  3.35406 0.222831 1.455924
C  -0.997554 0.374328 -0.071836
C  1.189201 2.094642 -0.342986
C  -1.126932 1.775888 -0.304491
C  -2.18894 -0.505761 0.080889
C  -4.621529 -0.611683 0.0191
H  3.481829 0.249184 -0.716774
H  2.930063 -2.21507 0.423254
H  0.666296 -1.863306 1.300367
H  0.248978 -2.331385 -0.346502
H  2.656857 -0.078735 2.259256
H  4.289544 -0.353179 1.574407
H  3.589349 1.292354 1.601445
H  2.014746 2.807004 -0.45697
H  1.945567 -1.405247 -2.146687
H  -2.122661 2.22063 -0.384314
H  -4.688638 -1.035202 1.035147
H  -4.628845 -1.432962 -0.716857
H  -5.437651 0.099079 -0.170402
