program: Gaussian 09
title: 000126743
version: EM64L-G09RevD.01
frameworkgroup: C1[X(C13H14N2O3)]
method: RPBEPBE
basis: SDD
operation: Freq
keyword: #p
keyword: freq=noraman
keyword: PBEPBE/SDD
title: #p freq=noraman PBEPBE/SDD
converged: YES YES NO NO
title: Mulliken charges:
elementType: O O O N N C C C C C C C C C C C C C H H H H H H H H H H H H H H
charge: -0.439105 -0.413140 -0.229448 -0.308860 -0.458283 -0.239209 0.137164 0.141273 -0.531944 -0.189239 0.164282 0.193222 -0.393008 0.141086 -0.415913 -0.365436 -0.254102 -0.222341 0.244139 0.238899 0.230923 0.273815 0.267881 0.333599 0.233179 0.224783 0.231768 0.233511 0.219486 0.220863 0.348135 0.382019
chargesum: 0.00000
title: Mulliken charges with hydrogens summed into heavy atoms:
elementType: O O O N N C C C C C C C C C C C C C
charge: -0.090970 -0.031121 -0.229448 -0.040979 -0.124684 0.004930 0.137164 0.141273 -0.062122 0.084576 0.164282 0.193222 0.064954 0.141086 -0.184145 -0.131925 -0.034615 -0.001478
polarizability: 2.16361463e+02 -1.00983146e+01 1.71586937e+02 4.35328507e+00 -8.80230457e+00 9.71559092e+01
1716.lowfreq: -8.7319 -5.3557 -0.0007 -0.0006 -0.0004 7.2956 20.2467 35.4975 47.1694
frequency: 19.3893 35.4318 47.1483 70.3279 97.7377 111.0199 159.2493 166.1194 218.7275 256.3804 268.8353 282.7967 303.2351 323.2768 338.7155 416.7006 433.0506 465.2206 517.5073 530.8387 533.4969 571.1163 583.0433 584.0026 606.9458 622.5642 624.7223 662.5337 710.9631 749.1799 757.1422 759.5779 768.5794 830.3812 851.0480 865.1352 870.3587 911.3009 931.1668 945.0669 970.4741 971.0436 986.4072 1010.9866 1045.3805 1054.5505 1098.2713 1113.6372 1118.2000 1147.3248 1169.0226 1181.5806 1202.6695 1222.0510 1234.7295 1241.4930 1250.5559 1274.6396 1287.9003 1306.3805 1322.6471 1334.7608 1355.7610 1363.0714 1383.6888 1409.2462 1439.4795 1448.7395 1464.0061 1466.6711 1472.2576 1481.2881 1575.9662 1589.0511 1630.5324 1663.9125 2938.4595 2956.4967 2987.7817 3016.5364 3036.7693 3085.7268 3122.4018 3130.1489 3143.8763 3161.8151 3417.8027 3508.2283 3570.6737 3590.2258
redmass: 3.7063 5.9873 5.4919 4.4306 4.2652 5.4781 3.1317 3.9791 3.5509 2.2955 5.9129 4.3247 2.9999 2.1871 4.1518 3.2857 3.3950 4.1178 2.8389 2.0607 2.1055 3.2397 4.0436 2.7512 1.6892 3.4805 3.3112 2.5726 4.0325 1.4427 4.5164 4.1386 4.6369 3.7106 1.5019 2.6773 2.4675 3.2502 1.3853 3.3565 1.3004 4.0920 2.7333 2.0642 2.4028 3.1268 1.9326 1.7727 2.2046 2.1284 1.1705 1.3423 1.4692 1.4943 1.5815 1.8483 1.4725 1.3452 1.8038 1.7295 1.4694 1.4729 2.1589 1.5721 1.2549 3.9977 3.1274 1.2164 4.0555 1.1603 1.1194 2.9146 7.1405 6.4032 7.1884 8.7103 1.0822 1.0640 1.0666 1.0922 1.0893 1.0988 1.0848 1.0890 1.0952 1.1001 1.0745 1.0639 1.0665 1.0801
irintensity: 2.6326 1.8788 1.3769 0.2615 2.0643 2.1564 0.4743 2.1013 18.7746 79.1960 8.4010 4.0619 45.1974 101.2739 0.9127 12.6022 7.4108 28.3767 24.3998 42.7724 39.0444 6.0621 18.9195 18.7931 55.7251 24.4788 69.6570 175.5764 18.4489 89.2657 0.0858 20.9715 8.5954 32.9592 2.8492 29.5113 5.3840 4.3021 3.4503 2.9115 0.0129 16.9544 0.1529 7.8701 261.6822 30.6333 79.0796 1.5270 8.1776 20.8094 3.0869 16.2802 3.1865 3.5223 21.6700 13.9124 2.4724 11.5721 9.2444 18.7236 37.1043 52.7268 18.2393 34.0801 7.8608 12.7609 11.2810 15.5217 23.7759 3.6798 7.3027 0.7064 1.0181 3.2622 0.7889 223.7581 28.5455 33.2340 63.7997 5.0320 24.5134 21.4831 1.5762 3.0976 35.4212 34.0284 4.0555 25.5812 5.4104 77.2665
temp: 298.150 k
press: 1.00000 atm
elementType: 8 8 8 7 7 6 6 6 6 6 6 6 6 6 6 6 6 6 1 1 1 1 1 1 1 1 1 1 1 1 1 1
symmnumber: 1
zpe: 662464.1 jmol-1
zpe.correction: 0.252319 hartree
zpe.thermalcorrener: 0.268306 hartree
zpe.thermalcorrenthalpy: 0.269250 hartree
zpe.thermalcorrgfe: 0.207182 hartree
zpe.sumelectzpe: -837.648827 hartree
zpe.sumelectthermal: -837.632841 hartree
zpe.sumelectthermalent: -837.631897 hartree
zpe.sumelectthermalfe: -837.693965 hartree
dipole: -0.2929 -0.2171 -0.7920
dipole: 0.8719
quadrupole: -104.3710 -97.8172 -108.0599
quadrupole: 7.5754 3.3013 -4.6264
quadrupole: -0.9550 5.5988 -4.6438 7.5754 3.3013 -4.6264
hfenergy: -837.9011465 hartree
pointgroup: C01 [X(C13H14N2O3)]
dipole: -0.1015138 -0.0984769 -0.3125113 debye
polarizability: 217.5173337|-5.886978|169.9912878|7.456682|-9.3322504|97.5956884 unknown
InChI: InChI=1S/C13H14N2O3/c16-6-11-12-8(5-10(14-11)13(17)18)7-3-1-2-4-9(7)15-12/h1-4,10-11,14-17H,5-6H2
charge 0 multiplicity 1
32 atoms
O  -0.522483 3.403259 0.92643
O  -3.769009 -2.55939 -0.640802
O  -4.02985 -1.139312 1.180741
N  -2.356922 0.734958 -0.108152
N  1.335704 1.53418 -0.423326
C  -1.258626 1.56444 -0.680969
C  0.237672 -0.449284 -0.117841
C  0.078776 0.910251 -0.391015
C  -0.921629 -1.407484 0.011744
C  -2.247332 -0.69551 -0.470126
C  1.658299 -0.686634 0.053102
C  2.322357 0.580931 -0.134304
C  -1.377549 3.04254 -0.214768
C  -3.436442 -1.435548 0.120925
C  2.43817 -1.836498 0.346688
C  3.722034 0.720995 -0.018744
C  3.836123 -1.701543 0.45823
C  4.470774 -0.436418 0.280286
H  -1.428489 1.572863 -1.779555
H  -0.771114 -2.323724 -0.590638
H  -1.030595 -1.734422 1.067136
H  -2.290623 -0.771654 -1.57185
H  -2.468252 0.848265 0.911084
H  1.459026 2.54532 -0.383749
H  -2.446232 3.250635 -0.004585
H  -1.04072 3.723335 -1.012994
H  1.962016 -2.81374 0.487051
H  4.215548 1.689159 -0.159321
H  4.451036 -2.579597 0.685401
H  5.560104 -0.36387 0.374283
H  -0.701119 2.798699 1.689832
H  -4.512754 -3.052904 -0.198591
