program: Gaussian 09
title: 000126724
version: EM64L-G09RevD.01
frameworkgroup: C1[X(C13H19NO3)]
method: RPBEPBE
basis: SDD
operation: Freq
keyword: #p
keyword: freq=noraman
keyword: PBEPBE/SDD
title: #p freq=noraman PBEPBE/SDD
converged: YES YES NO NO
title: Mulliken charges:
elementType: O O O N C C C C C C C C C C C C C H H H H H H H H H H H H H H H H H H H
charge: -0.429815 -0.300275 -0.302655 -0.187932 -0.259678 0.376123 -0.403300 -0.564625 0.386416 -0.332701 -0.553404 -0.626132 -0.587131 0.183569 0.205627 -0.530473 -0.529856 0.207981 0.220003 0.206161 0.235267 0.221849 0.233065 0.176373 0.259836 0.230776 0.237247 0.204606 0.259089 0.355310 0.228988 0.253810 0.220049 0.253301 0.224756 0.227780
chargesum: 0.00000
title: Mulliken charges with hydrogens summed into heavy atoms:
elementType: O O O N C C C C C C C C C C C C C
charge: -0.074505 -0.300275 -0.302655 -0.187932 -0.051698 0.376123 0.022864 -0.107510 0.386416 0.076737 -0.293568 0.046496 -0.328042 0.183569 0.205627 0.172374 0.175980
polarizability: 2.10600911e+02 -3.48239464e+00 1.52940711e+02 5.41378520e+00 4.42719654e+00 1.11797816e+02
1716.lowfreq: -11.1058 -5.4553 0.0006 0.0006 0.0010 9.2715 37.7799 49.1237 74.0950
frequency: 37.2052 49.1042 74.0926 79.4735 105.8283 123.4016 142.4572 161.7647 167.9876 184.0688 204.0758 215.3274 226.1648 258.8868 284.6146 287.7134 318.2196 341.9410 368.1998 391.2258 428.5289 452.7693 494.0191 499.9601 529.4787 582.6294 628.4209 677.6469 699.0893 704.7717 719.3118 740.7991 773.2063 808.0186 871.7768 885.8712 894.8205 907.9651 954.6457 956.0718 974.4923 1011.5417 1013.8894 1041.7869 1069.6388 1085.1392 1113.0176 1114.4555 1116.0969 1120.5299 1148.9645 1151.2979 1158.8393 1167.3373 1185.3774 1199.7421 1218.1642 1233.8629 1244.7339 1274.8560 1279.2682 1311.9353 1320.6347 1340.2668 1370.2233 1374.0714 1395.9655 1396.9340 1425.1480 1436.2881 1445.5537 1449.5474 1457.4648 1459.3338 1468.1387 1477.2701 1477.7715 1482.6339 1486.7148 1487.7699 1491.3912 1575.8395 1620.3065 2884.8016 2889.2230 2899.8624 2926.4085 2968.8673 2972.3551 2979.9100 3027.9710 3034.6445 3044.9283 3064.7417 3064.9606 3068.8618 3087.4915 3119.5229 3120.1711 3132.9584 3142.3664 3222.1873
redmass: 4.0465 4.7097 3.3328 4.1477 2.7157 2.8932 3.2599 1.1859 1.1088 2.1444 1.8807 1.7844 3.2690 3.1851 4.7537 3.0336 2.9838 3.7703 2.9661 4.4165 3.9277 3.5602 3.6842 4.1221 4.1202 3.3043 4.6215 1.6280 3.8620 2.3079 4.6301 3.4151 3.0761 3.0415 2.7891 1.6424 1.8929 2.3093 6.1974 3.0599 2.1533 2.1721 3.5686 2.0738 1.9570 3.5877 1.4984 1.2417 1.2437 2.3137 1.3241 1.3387 1.3306 1.4054 1.7275 1.8064 1.5539 1.3897 1.5978 2.4066 2.1614 1.4602 1.4826 1.7630 2.1348 2.5149 2.1307 1.3502 1.1748 1.1758 1.3717 1.1322 1.0563 1.0613 1.0574 1.0596 1.0586 1.1816 1.0740 1.0540 2.6702 8.3544 7.2368 1.0728 1.0750 1.0554 1.0728 1.0311 1.0309 1.0622 1.0902 1.0783 1.0991 1.1037 1.0919 1.1039 1.1010 1.1026 1.1028 1.0911 1.0918 1.0631
irintensity: 1.6604 3.0423 4.5527 5.5670 5.3364 3.6179 0.2684 0.1179 0.0753 1.0284 4.6475 6.8530 1.4588 1.5039 6.8045 7.8472 0.6254 6.3656 12.9843 5.5629 7.0575 1.0360 2.5761 2.3410 0.0724 2.3255 7.7426 97.5668 12.8969 53.8507 4.6689 7.0544 2.3698 23.2825 9.1876 2.5791 0.9658 57.3820 86.8447 21.2474 4.3096 6.5583 56.2047 14.4522 11.5420 41.7562 22.7105 12.7221 3.4866 42.3940 15.6550 21.1985 11.5319 17.7539 19.3286 27.7317 9.1131 9.2627 5.7194 61.8198 61.9462 16.5856 19.8486 17.7621 11.1698 33.0845 14.3357 53.5472 0.1037 16.0234 3.2744 15.7674 13.3660 6.7269 16.3970 8.7909 8.5487 6.5274 14.0694 16.5438 154.1575 0.1610 5.3594 41.0843 28.4923 139.7895 163.0077 86.6948 64.0490 21.8507 53.3347 43.3384 28.0188 30.3397 37.6262 24.7813 22.0185 24.5364 26.7347 7.2360 3.7871 108.6328
temp: 298.150 k
press: 1.00000 atm
elementType: 8 8 8 7 6 6 6 6 6 6 6 6 6 6 6 6 6 1 1 1 1 1 1 1 1 1 1 1 1 1 1 1 1 1 1 1
symmnumber: 1
zpe: 786891.7 jmol-1
zpe.correction: 0.299711 hartree
zpe.thermalcorrener: 0.317239 hartree
zpe.thermalcorrenthalpy: 0.318183 hartree
zpe.thermalcorrgfe: 0.254564 hartree
zpe.sumelectzpe: -785.836830 hartree
zpe.sumelectthermal: -785.819303 hartree
zpe.sumelectthermalent: -785.818358 hartree
zpe.sumelectthermalfe: -785.881977 hartree
dipole: -0.1045 0.5360 -3.3649
dipole: 3.4089
quadrupole: -87.6582 -98.0299 -108.5203
quadrupole: -3.8666 10.9930 6.3382
quadrupole: 10.4113 0.0396 -10.4508 -3.8666 10.9930 6.3382
hfenergy: -786.1365415 hartree
pointgroup: C01 [X(C13H19N1O3)]
dipole: -0.0735155 -0.2057856 1.3232415 debye
polarizability: 210.7134704|4.1637182|153.0878153|-2.8471231|4.2859249|111.5381524 unknown
InChI: InChI=1S/C13H19NO3/c1-14-5-4-9-6-12(16-2)13(17-3)7-10(9)11(14)8-15/h6-7,11,15H,4-5,8H2,1-3H3
charge 0 multiplicity 1
36 atoms
O  -2.719661 0.673108 -2.2374
O  2.806033 1.662082 0.263823
O  3.33231 -1.212525 -0.003798
N  -3.148736 -0.191918 0.248576
C  -2.073165 0.847043 0.139504
C  -0.658982 0.266787 0.149476
C  -2.746241 -1.486647 0.852909
C  -1.574747 -2.092294 0.063499
C  -0.403267 -1.126212 0.065923
C  -2.360406 1.625034 -1.198633
C  0.4326 1.164215 0.232468
C  -4.395988 0.348637 0.833106
C  0.933378 -1.585218 0.009593
C  1.762871 0.706606 0.19602
C  2.017865 -0.688002 0.046362
C  3.687829 1.525598 1.446531
C  4.116461 -0.779567 -1.184783
H  -2.145922 1.580607 0.977744
H  -3.625588 -2.156639 0.813171
H  -2.458257 -1.372862 1.92647
H  -1.909864 -2.295724 -0.972939
H  -1.278984 -3.059608 0.509971
H  -1.461034 2.171037 -1.528858
H  -3.180322 2.359532 -1.031217
H  0.270694 2.243627 0.335918
H  -5.204162 -0.397922 0.738836
H  -4.706854 1.255149 0.286146
H  -4.286221 0.61298 1.911605
H  1.154075 -2.655276 -0.072957
H  -3.17234 -0.059364 -1.707429
H  4.456656 2.304807 1.330509
H  4.15179 0.523335 1.48124
H  3.10934 1.702228 2.373537
H  4.200296 0.321647 -1.221375
H  3.639647 -1.149254 -2.112308
H  5.108697 -1.240325 -1.062841
