program: Gaussian 09
title: 000126648
version: EM64L-G09RevD.01
frameworkgroup: C1[X(C17H14O4)]
method: RPBEPBE
basis: SDD
operation: Freq
keyword: #pfreq=noraman
keyword: PBEPBE/SDD
title: #p freq=noraman PBEPBE/SDD
converged: YES YES NO NO
title: Mulliken charges:
elementType: O O O O C C C C C C C C C C C C C C C C C H H H H H H H H H H H H H H
charge: -0.256184 -0.256185 -0.261961 -0.257686 0.039459 0.292174 0.194047 0.167112 0.241575 0.233386 -0.396117 0.135309 -0.360794 -0.394087 -0.390570 -0.362156 -0.214970 -0.250078 -0.208632 -0.535217 -0.535992 0.264428 0.278721 0.244464 0.244544 0.260249 0.225233 0.232952 0.232642 0.222264 0.250161 0.223123 0.223713 0.222197 0.252875
chargesum: 0.00000
title: Mulliken charges with hydrogens summed into heavy atoms:
elementType: O O O O C C C C C C C C C C C C C C C C C
charge: -0.256184 -0.256185 -0.261961 -0.257686 0.039459 0.292174 0.194047 0.167112 0.241575 0.233386 -0.131688 0.135309 -0.082073 -0.149623 -0.146026 -0.101907 0.010263 -0.017126 0.024009 0.160331 0.162793
polarizability: 2.81751391e+02 -2.57508448e-01 2.08261660e+02 4.99020357e+00 -2.08002618e+01 1.31381109e+02
1716.lowfreq: -7.6434 -4.6034 -0.0009 -0.0007 -0.0005 6.1229 21.3923 42.0912 56.6096
frequency: 21.3025 42.0785 56.5933 68.8424 105.8456 112.5144 147.8194 154.0846 163.3705 186.4609 191.8090 238.5301 264.3109 268.2471 272.3695 279.4290 309.5132 345.4117 353.7708 428.6520 464.3315 485.4098 489.8878 512.0375 521.8570 549.5292 560.1375 597.0762 602.7953 622.6387 654.8485 670.4979 703.2086 729.3015 735.9979 758.6665 782.1196 786.5776 828.7277 840.0821 858.9174 873.5883 875.9857 883.8327 952.5203 970.8681 980.9323 988.4156 999.6313 1023.5190 1071.1510 1080.7063 1091.4752 1110.7207 1113.2376 1124.7852 1149.4535 1159.6022 1161.8931 1195.2637 1197.8577 1226.8357 1229.5777 1247.5895 1260.0046 1276.7900 1327.2297 1379.4985 1399.2347 1424.7852 1437.6316 1445.4241 1457.2259 1459.4770 1461.8763 1468.8114 1469.7909 1472.4899 1479.8234 1553.2925 1572.3923 1595.0184 1596.6827 1619.5263 1629.4651 2963.8136 2965.2050 3054.3876 3056.2807 3130.0677 3131.0242 3135.9490 3139.1786 3149.5291 3163.4764 3172.9975 3174.6196 3181.8818 3193.5213
redmass: 5.7802 5.3805 4.7252 3.0968 3.6157 5.5591 5.0949 4.9966 4.7456 1.7206 5.2967 1.1130 5.1648 3.6482 1.8051 5.9475 4.1875 6.0788 4.7790 3.4435 6.7168 6.2569 7.8488 6.0912 3.7933 5.9815 5.8890 4.7363 4.6647 5.8089 5.0642 3.5422 6.4855 1.5534 5.8019 2.5179 1.5257 3.3738 6.0633 1.4466 6.0790 2.9411 2.0673 1.5644 1.3093 1.3654 7.3040 7.7652 1.3250 2.1050 4.3935 4.4347 1.9207 1.2562 1.2563 1.6519 1.3468 1.3071 1.2676 1.2425 2.2757 2.3254 2.3211 1.6909 4.3368 1.9978 3.8308 10.1933 10.2394 1.3452 1.2773 2.4471 1.8139 2.3905 2.0034 1.0530 1.0537 1.0732 1.3804 9.3119 7.0538 7.3635 7.2800 7.1022 8.3747 1.0328 1.0327 1.1042 1.1043 1.0996 1.0998 1.0859 1.0879 1.0901 1.0957 1.0912 1.0996 1.0969 1.0926
irintensity: 1.3310 0.4274 0.6583 9.4947 0.1609 1.8339 4.0169 1.8819 0.7187 0.0937 3.5234 0.0720 0.9425 1.3339 0.3287 5.7130 3.3043 2.7934 1.1138 2.0485 2.6514 0.1875 0.5078 2.1322 1.8578 9.1922 21.4120 3.8981 1.6526 5.2636 1.9010 4.3049 0.2124 49.1708 3.2414 30.7668 47.5234 55.3094 7.7829 0.1594 1.3031 26.6220 17.3991 4.8956 0.4029 2.4311 42.2182 5.1277 0.3402 27.4510 76.4254 192.0942 8.0351 0.1439 0.0628 35.8409 3.9401 4.6842 0.6786 5.8907 56.9279 32.9745 125.0599 22.0352 4.0596 16.8727 275.1545 11.9626 11.8662 74.6582 2.0946 72.2292 136.4680 4.1035 26.4175 12.3368 11.3741 23.8572 2.4259 149.8966 0.9859 34.9864 147.8710 68.8407 326.0316 75.3477 64.8794 39.3286 41.3848 17.3906 15.9814 4.2279 7.2246 5.6576 16.1364 11.3639 18.9991 13.6135 1.9470
temp: 298.150 k
press: 1.00000 atm
elementType: 8 8 8 8 6 6 6 6 6 6 6 6 6 6 6 6 6 6 6 6 6 1 1 1 1 1 1 1 1 1 1 1 1 1 1
symmnumber: 1
zpe: 699058.4 jmol-1
zpe.correction: 0.266257 hartree
zpe.thermalcorrener: 0.284536 hartree
zpe.thermalcorrenthalpy: 0.285480 hartree
zpe.thermalcorrgfe: 0.219141 hartree
zpe.sumelectzpe: -955.589705 hartree
zpe.sumelectthermal: -955.571426 hartree
zpe.sumelectthermalent: -955.570481 hartree
zpe.sumelectthermalfe: -955.636821 hartree
dipole: -4.7470 3.3709 -2.8104
dipole: 6.4650
quadrupole: -97.9653 -105.4616 -126.9608
quadrupole: 11.3992 -7.3123 9.2985
quadrupole: 12.1639 4.6677 -16.8315 11.3992 -7.3123 9.2985
hfenergy: -955.8559619 hartree
pointgroup: C01 [X(C17H14O4)]
dipole: 1.9054054 -0.5570883 -1.5901436 debye
polarizability: 281.8698779|2.042155|169.5494363|-2.2555921|43.7344024|169.9748456 unknown
InChI: InChI=1S/C17H14O4/c1-19-14-8-5-9-15(20-2)17(14)16-10-12(18)11-6-3-4-7-13(11)21-16/h3-10H,1-2H3
charge 0 multiplicity 1
35 atoms
O  -0.661849 -0.064051 -0.711588
O  1.167125 -2.220923 -0.419015
O  1.865481 2.313663 0.895796
O  -2.487738 1.015415 2.901116
C  1.553886 0.050916 0.194221
C  0.099373 0.197211 0.440794
C  -2.726921 0.355856 0.576129
C  -2.064133 -0.005465 -0.626222
C  2.091953 -1.182904 -0.278719
C  2.451773 1.134057 0.425388
C  -0.487969 0.554148 1.631344
C  -1.938539 0.674922 1.799301
C  -4.14605 0.401314 0.574933
C  3.47744 -1.324984 -0.541607
C  3.840198 0.999425 0.170572
C  -2.775342 -0.313768 -1.807253
C  4.332519 -0.227952 -0.315083
C  -4.870212 0.097097 -0.589696
C  -4.180873 -0.260559 -1.782165
C  1.654615 -3.519259 -0.892331
C  2.732995 3.474721 1.116509
H  0.148053 0.762425 2.493753
H  -4.640323 0.681197 1.511313
H  3.888187 -2.269548 -0.905887
H  4.526601 1.832175 0.34105
H  -2.220894 -0.585647 -2.710076
H  5.40433 -0.333287 -0.515937
H  -5.964528 0.134671 -0.584117
H  -4.746058 -0.496961 -2.690292
H  2.088868 -3.439438 -1.907347
H  0.762853 -4.161883 -0.918937
H  2.402687 -3.94607 -0.196673
H  3.224227 3.793218 0.177096
H  3.498812 3.263469 1.887328
H  2.057255 4.266299 1.470902
