program: Gaussian 09
title: 000126571
version: EM64L-G09RevD.01
frameworkgroup: C1[X(C14H19NO)]
method: RPBEPBE
basis: SDD
operation: Freq
keyword: #p
keyword: freq=noraman
keyword: PBEPBE/SDD
title: #p freq=noraman PBEPBE/SDD
converged: YES YES NO NO
title: Mulliken charges:
elementType: O N C C C C C C C C C C C C C C H H H H H H H H H H H H H H H H H H H
charge: -0.445543 -0.105724 -0.057313 -0.193832 -0.455223 -0.518318 0.343175 -0.385609 -0.370841 -0.498867 0.128846 -0.642787 -0.426048 0.152647 -0.237732 -0.438235 0.194477 0.211529 0.210462 0.192870 0.215987 0.210320 0.186807 0.228612 0.164439 0.207551 0.238003 0.236964 0.187516 0.233892 0.220040 0.222638 0.221052 0.215292 0.352953
chargesum: 0.00000
title: Mulliken charges with hydrogens summed into heavy atoms:
elementType: O N C C C C C C C C C C C C C C
charge: -0.092590 -0.105724 0.137164 0.017697 -0.051891 -0.092011 0.343175 0.029811 0.001149 -0.023900 0.128846 -0.001339 -0.203410 0.152647 -0.016680 -0.222942
polarizability: 1.81229051e+02 1.96367928e+00 1.65502018e+02 -1.23255045e+01 1.59306886e+00 1.12510516e+02
1716.lowfreq: -15.5514 -9.3293 0.0007 0.0009 0.0009 7.7298 52.1802 68.7248 108.9539
frequency: 52.1102 68.7027 108.9478 180.4387 196.9762 218.4812 229.2472 258.4337 284.8412 303.6801 344.9169 363.0906 371.6844 381.0297 394.9635 451.3749 472.6646 487.0837 506.7404 518.8785 525.7586 565.2627 593.5575 652.1629 690.1545 729.8869 774.0809 784.1680 795.8710 832.7038 856.4319 866.1671 873.1629 881.5033 917.6990 948.8859 962.5512 993.8554 999.7849 1039.6034 1052.3634 1082.3358 1086.7882 1089.9715 1108.6441 1121.3793 1122.3764 1154.6755 1164.3916 1169.8419 1176.5120 1178.0763 1207.7544 1223.7263 1242.2554 1252.4751 1257.9647 1275.7803 1279.8256 1310.4965 1314.0373 1334.7290 1343.8275 1352.9844 1355.7107 1359.0260 1370.7212 1388.2118 1434.4797 1445.6207 1452.2280 1454.0647 1462.3024 1472.8774 1477.9698 1482.9877 1489.4823 1492.6843 1590.4123 1617.0733 2792.5065 2808.4266 2852.0233 2941.2960 2977.1204 2986.2750 2993.5266 2993.8172 3018.5119 3029.0580 3040.6546 3046.7908 3049.3320 3058.7494 3085.1285 3110.2295 3133.3617 3156.6894 3581.6983
redmass: 3.7583 4.3165 3.0749 2.7427 2.8310 1.2746 2.9086 3.7671 2.8781 2.8416 3.7346 1.1640 2.0634 1.9553 2.5579 3.5207 3.2943 3.8036 3.7496 2.7702 5.9661 3.7722 3.2905 2.5081 3.8660 1.6972 3.4722 2.6455 2.4386 2.3442 1.6765 2.2279 2.7146 1.6272 2.3892 1.3812 2.0293 1.8309 2.3080 1.9897 2.0052 2.1658 1.6937 1.7821 1.5476 1.4756 1.7133 1.7224 1.2807 1.6469 1.4527 1.3426 1.9766 1.4962 1.5506 2.2298 1.3199 2.2067 1.3111 1.8684 1.5229 1.4164 1.4681 1.4554 1.5298 1.4981 1.4124 5.8390 1.1758 1.3528 1.1650 1.6751 1.0701 1.0928 1.1039 1.3422 1.5772 1.1500 6.9668 6.8926 1.0794 1.0714 1.0579 1.0805 1.0679 1.0635 1.0626 1.0638 1.0858 1.0722 1.0940 1.0938 1.1008 1.1026 1.0996 1.0879 1.0890 1.0981 1.0658
irintensity: 0.3808 0.5646 0.6920 0.2537 1.1426 0.3666 0.3531 8.0715 21.8866 2.5481 2.9817 109.0244 1.6435 2.7572 3.9859 2.5185 1.7637 0.3347 0.9039 0.8341 4.5951 0.4675 0.6657 2.6658 3.9126 46.3362 17.3790 21.6751 7.1278 5.9711 8.6651 22.5892 2.6161 13.4839 12.3059 1.0745 9.0040 14.0841 13.0893 59.7564 8.1305 8.3012 2.1266 13.9189 36.9252 12.7206 18.5291 23.1867 22.7468 4.7054 18.3682 24.5977 1.6323 1.3031 17.1181 66.5473 13.1514 15.1963 2.6464 2.8901 1.1520 10.7193 2.0267 4.3204 1.2333 6.6597 4.1183 7.5482 6.2599 2.8546 11.8617 44.2779 13.8035 9.9227 7.7891 19.4184 2.4238 17.6987 47.4551 15.1765 45.2527 150.7584 197.0921 20.0935 58.3344 13.5237 49.9427 28.9455 55.3835 38.8795 30.2590 38.3509 55.2154 57.4690 34.0273 13.4051 17.7214 28.9554 25.6554
temp: 298.150 k
press: 1.00000 atm
elementType: 8 7 6 6 6 6 6 6 6 6 6 6 6 6 6 6 1 1 1 1 1 1 1 1 1 1 1 1 1 1 1 1 1 1 1
symmnumber: 1
zpe: 791819.0 jmol-1
zpe.correction: 0.301588 hartree
zpe.thermalcorrener: 0.315390 hartree
zpe.thermalcorrenthalpy: 0.316334 hartree
zpe.thermalcorrgfe: 0.262124 hartree
zpe.sumelectzpe: -673.647458 hartree
zpe.sumelectthermal: -673.633656 hartree
zpe.sumelectthermalent: -673.632712 hartree
zpe.sumelectthermalfe: -673.686922 hartree
dipole: -0.0962 0.4184 0.0915
dipole: 0.4390
quadrupole: -82.1450 -93.7851 -96.9384
quadrupole: 0.1094 -4.3351 0.4397
quadrupole: 8.8112 -2.8289 -5.9822 0.1094 -4.3351 0.4397
hfenergy: -673.9490457 hartree
pointgroup: C01 [X(C14H19N1O1)]
dipole: -0.0364944 -0.1643053 -0.0387491 debye
polarizability: 181.0539873|-2.0654364|165.4162681|12.8299253|2.4413173|112.7713286 unknown
InChI: InChI=1S/C14H19NO/c1-15-9-3-5-11-10-4-2-6-14(16)12(10)7-8-13(11)15/h2,4,6,11,13,16H,3,5,7-9H2,1H3
charge 0 multiplicity 1
35 atoms
O  2.994855 1.914563 0.669357
N  -2.130692 0.641409 0.563682
C  -1.667809 0.534852 -0.85111
C  -0.828713 -0.757995 -1.080866
C  -1.643422 -1.99647 -0.622791
C  -0.81214 1.750473 -1.26818
C  0.58502 -0.664408 -0.475725
C  -2.087836 -1.84283 0.844454
C  -2.902793 -0.548876 1.003233
C  0.410688 1.90651 -0.344817
C  1.160046 0.598496 -0.161056
C  -2.895727 1.877529 0.832162
C  1.359486 -1.841644 -0.289411
C  2.480954 0.633549 0.357546
C  2.673291 -1.781751 0.216317
C  3.246698 -0.536135 0.549585
H  -2.557246 0.472255 -1.537395
H  -0.701609 -0.836859 -2.183085
H  -1.075603 -2.932245 -0.769103
H  -2.543092 -2.073936 -1.268391
H  -1.40687 2.681827 -1.277079
H  -0.478004 1.581234 -2.310894
H  -2.703961 -2.707251 1.158171
H  -1.201667 -1.799834 1.504395
H  -3.859148 -0.647543 0.41934
H  -3.182491 -0.401099 2.063539
H  0.085062 2.26469 0.651904
H  1.100797 2.676946 -0.734775
H  -3.796829 1.988087 0.175149
H  -2.263928 2.771449 0.700258
H  -3.240755 1.866227 1.881493
H  0.937105 -2.819114 -0.542005
H  3.252847 -2.701481 0.35187
H  4.268355 -0.478104 0.947786
H  3.91943 1.83798 1.012541
