program: Gaussian 09
title: 000126550
version: EM64L-G09RevD.01
frameworkgroup: C1[X(C9H12ClFN2O4)]
method: RPBEPBE
basis: SDD
operation: Freq
keyword: #p
keyword: freq=noraman
keyword: PBEPBE/SDD
title: #p freq=noraman PBEPBE/SDD
converged: YES YES NO NO
title: Mulliken charges:
elementType: Cl F O O O O N N C C C C C C C C C H H H H H H H H H H H H
charge: -0.061278 -0.164992 -0.245259 -0.281351 -0.238025 -0.246229 -0.218146 -0.364615 -0.261739 -0.332026 -0.221084 0.198557 0.230594 -0.162478 0.212415 -0.233463 -0.586466 0.255314 0.269888 0.216190 0.256566 0.191885 0.207202 0.196227 0.216974 0.355940 0.278864 0.252850 0.277684
chargesum: 0.00000
title: Mulliken charges with hydrogens summed into heavy atoms:
elementType: Cl F O O O O N N C C C C C C C C C
charge: -0.061278 -0.164992 -0.245259 -0.281351 -0.238025 -0.246229 -0.218146 -0.008676 0.263462 0.140731 0.178003 0.198557 0.230594 0.250723 0.212415 0.045401 -0.055932
polarizability: 1.55382682e+02 -1.78028423e+01 1.41325261e+02 4.89624820e+00 1.66484216e+01 1.00601344e+02
1716.lowfreq: -4.5823 -3.2133 -0.0006 -0.0004 0.0013 7.5234 14.0016 23.5138 29.4769
frequency: 13.9777 23.2809 29.3968 50.2722 69.0140 84.6600 106.7038 114.9519 153.0757 160.7416 178.6721 268.8320 281.7448 293.1386 301.4611 334.5117 346.5909 393.8369 414.5877 442.7949 458.6379 466.6980 495.1862 540.6482 602.2800 608.8766 620.8643 665.1671 719.3460 738.4903 773.8143 777.1484 804.3130 870.7761 889.9441 908.6205 945.9220 959.8539 972.6970 1006.1143 1039.4032 1047.8687 1072.8353 1102.9971 1106.2780 1161.7475 1171.1365 1179.4878 1212.5644 1223.2389 1230.3734 1265.2198 1296.8863 1299.8962 1319.7103 1337.6121 1350.8734 1367.3312 1397.9538 1403.0879 1432.1302 1435.4763 1446.2071 1452.7710 1457.8828 1471.4759 1599.9860 1664.0261 1668.2162 2904.9998 2926.7896 2981.1984 2990.2063 3011.9311 3063.7853 3066.4934 3084.0404 3144.5247 3147.6240 3196.3444 3566.8980
redmass: 11.0120 6.9799 6.2038 7.3973 4.8079 7.4165 4.7299 10.4936 7.4453 5.1926 3.0413 3.2251 3.5457 2.9725 8.4875 4.9814 6.2788 5.3228 2.9722 8.5967 2.7945 5.1952 2.5406 5.8848 4.7737 4.9434 1.2660 6.8347 6.0425 9.6677 2.3227 8.5098 3.4758 1.3722 2.4062 2.8817 2.8570 2.2175 2.9970 2.0460 3.4274 2.5262 3.1319 4.1688 2.1848 2.7283 1.4359 1.8792 1.1982 1.2053 4.7973 1.1898 1.1888 1.7048 1.3763 1.2519 1.3311 2.1864 1.4142 1.2837 1.1096 1.2387 1.8648 1.0832 1.1173 1.0848 9.2555 8.4845 5.8783 1.0622 1.0582 1.0962 1.0969 1.0649 1.0575 1.0565 1.1066 1.1112 1.1104 1.0954 1.0787
irintensity: 0.3474 4.0751 2.9161 4.1916 0.7963 3.8367 3.1021 5.1586 4.7408 4.2710 4.6789 7.7589 3.2874 3.8854 1.3474 3.0937 11.3555 16.4134 5.4771 5.8773 7.1477 1.4075 2.3138 25.9823 5.6647 22.4112 90.7136 35.6744 21.6992 25.0288 3.6540 28.0793 17.3113 26.6804 3.0843 20.9106 69.3725 26.8502 44.6597 17.2999 181.6843 43.2166 24.2023 80.0453 48.0720 74.9526 14.5896 7.1760 5.6328 1.9413 156.6506 2.8871 19.0585 46.3551 13.1652 18.6127 1.8318 25.5155 8.0375 11.6303 13.4236 18.5482 37.1107 13.2779 17.0181 8.9841 468.6075 177.0941 221.2766 64.9322 90.5315 41.1304 20.4282 52.3820 25.4302 7.7206 17.3555 2.6885 10.8881 1.7857 100.2645
temp: 298.150 k
press: 1.00000 atm
elementType: 17 9 8 8 8 8 7 7 6 6 6 6 6 6 6 6 6 1 1 1 1 1 1 1 1 1 1 1 1
symmnumber: 1
zpe: 563364.3 jmol-1
zpe.correction: 0.214574 hartree
zpe.thermalcorrener: 0.231826 hartree
zpe.thermalcorrenthalpy: 0.232771 hartree
zpe.thermalcorrgfe: 0.165593 hartree
zpe.sumelectzpe: -1319.132539 hartree
zpe.sumelectthermal: -1319.115286 hartree
zpe.sumelectthermalent: -1319.114342 hartree
zpe.sumelectthermalfe: -1319.181520 hartree
dipole: 0.1304 -0.4700 0.5859
dipole: 0.7623
quadrupole: -64.2846 -111.8875 -112.5259
quadrupole: -22.9959 -3.1987 -9.1683
quadrupole: 31.9481 -15.6549 -16.2932 -22.9959 -3.1987 -9.1683
hfenergy: -1319.3471129 hartree
pointgroup: C01 [X(C9H12Cl1F1N2O4)]
dipole: 0.0438076 0.0397221 0.2940364 debye
polarizability: 155.9270445|-7.2296587|135.904731|18.4183769|-19.7680646|105.4775113 unknown
InChI: InChI=1S/C9H12ClFN2O4/c10-1-2-16-3-4-17-6-13-8(14)7(11)5-12-9(13)15/h5,12H,1-4,6H2
charge 0 multiplicity 1
29 atoms
Cl 3.839237 0.801978 -2.403618
F  -3.534209 -2.580743 -0.584954
O  0.549912 0.530158 1.225309
O  3.190872 -0.666005 0.406539
O  -0.796229 -2.115373 -0.017012
O  -1.358525 2.45817 -1.080122
N  -1.050004 0.166116 -0.553615
N  -3.177962 1.011214 -1.195458
C  0.384661 0.401546 -0.214893
C  1.27734 -0.573583 1.880259
C  2.790093 -0.381648 1.792102
C  -1.545356 -1.173305 -0.393843
C  -1.816266 1.294244 -0.946468
C  4.562162 -0.274457 0.103365
C  -2.972867 -1.310109 -0.7042
C  -3.749132 -0.249447 -1.080407
C  4.795819 -0.468644 -1.38475
H  0.658841 1.362196 -0.67313
H  0.985285 -0.427317 -0.619226
H  0.960839 -0.533266 2.937337
H  0.979603 -1.544009 1.441577
H  3.306609 -1.077199 2.491904
H  3.053529 0.663584 2.061138
H  5.282393 -0.92337 0.656769
H  4.750364 0.780164 0.398191
H  -3.73712 1.81839 -1.476539
H  -4.814444 -0.353896 -1.296112
H  5.853572 -0.319941 -1.649156
H  4.437681 -1.45205 -1.722487
