program: Gaussian 09
title: 000126517
version: EM64L-G09RevD.01
frameworkgroup: C1[X(C6H10O5)]
method: RPBEPBE
basis: SDD
operation: Freq
keyword: #pfreq=noraman
keyword: PBEPBE/SDD
title: #p freq=noraman PBEPBE/SDD
converged: YES YES NO NO
title: Mulliken charges:
elementType: O O O O O C C C C C C H H H H H H H H H H
charge: -0.281906 -0.452140 -0.461637 -0.433212 -0.203018 -0.072830 -0.041836 -0.207869 0.160797 -0.392212 -0.358363 0.228622 0.232197 0.250134 0.263969 0.222604 0.194708 0.254604 0.372885 0.373129 0.351375
chargesum: 0.00000
title: Mulliken charges with hydrogens summed into heavy atoms:
elementType: O O O O O C C C C C C
charge: -0.281906 -0.079255 -0.088508 -0.081837 -0.203018 0.155792 0.190360 0.042265 0.160797 0.094361 0.090949
polarizability: 9.48170200e+01 -4.18427264e+00 8.58723448e+01 -4.53865676e+00 -1.03392156e-01 5.83731653e+01
1716.lowfreq: -11.0200 0.0005 0.0009 0.0011 5.4478 11.5416 68.0259 81.2329 102.0800
frequency: 68.0231 81.2283 102.0766 150.8981 197.5116 235.5832 262.7257 293.0311 336.0179 359.9550 388.6456 411.1449 432.5973 448.4322 459.1535 497.9195 564.1983 600.8023 674.7052 794.7106 829.1121 939.4428 960.3338 983.5234 997.9163 1018.6353 1036.8899 1048.8059 1058.4213 1106.9110 1139.3707 1179.8936 1204.5345 1213.5681 1235.9544 1254.5786 1282.9844 1294.5686 1317.4877 1339.4016 1340.0978 1346.6424 1380.1016 1393.4742 1437.6442 1460.4229 1626.0298 2941.0050 2951.0303 2960.7126 2968.4310 2985.1833 3111.6013 3112.2390 3445.3566 3545.4034 3549.4137
redmass: 6.0189 8.0456 4.0712 4.3805 3.1957 4.3637 3.9284 5.2101 4.2079 3.7519 1.7740 1.9700 1.2710 1.7061 1.6487 4.4312 3.6269 3.6815 5.4424 2.6237 2.7784 3.3151 3.9237 2.8838 3.8518 4.9290 3.9832 2.8228 3.6076 2.3566 1.4064 1.2945 1.2096 1.7630 1.4487 1.1980 1.2759 1.3320 1.2945 1.1952 1.2004 1.4153 1.2986 1.6997 1.0803 1.0813 10.3203 1.0691 1.0780 1.0758 1.0795 1.0836 1.0941 1.0950 1.0648 1.0655 1.0658
irintensity: 3.3024 0.8346 2.3011 6.3396 7.9101 2.5837 27.3801 25.3659 4.4170 13.8299 16.6828 10.2683 187.5257 64.8012 210.1252 4.9102 5.9186 15.9935 3.5850 27.5210 41.4332 5.3620 63.3340 20.6375 77.9535 56.9366 25.9328 60.4753 141.3493 20.7049 1.3241 16.5127 7.4892 30.8437 21.1398 52.9746 15.7082 1.4682 18.7556 16.3619 25.6058 27.3360 38.0757 6.2245 17.4850 5.5936 142.9771 17.9769 25.3666 12.5781 2.4597 116.1796 7.0757 7.1926 35.1458 10.7123 20.2747
temp: 298.150 k
press: 1.00000 atm
elementType: 8 8 8 8 8 6 6 6 6 6 6 1 1 1 1 1 1 1 1 1 1
symmnumber: 1
zpe: 426806.5 jmol-1
zpe.correction: 0.162562 hartree
zpe.thermalcorrener: 0.173801 hartree
zpe.thermalcorrenthalpy: 0.174745 hartree
zpe.thermalcorrgfe: 0.125753 hartree
zpe.sumelectzpe: -609.830544 hartree
zpe.sumelectthermal: -609.819305 hartree
zpe.sumelectthermalent: -609.818361 hartree
zpe.sumelectthermalfe: -609.867353 hartree
dipole: 1.5144 -1.0164 0.4362
dipole: 1.8753
quadrupole: -82.4079 -63.7937 -62.5253
quadrupole: 3.3158 3.3643 -4.6662
quadrupole: -12.8323 5.7820 7.0503 3.3158 3.3643 -4.6662
hfenergy: -609.9931061 hartree
pointgroup: C01 [X(C6H10O5)]
dipole: -0.6112532 0.3690562 0.1858 debye
dipolederiv: -0.6985844 0.1319087 0.0359697 0.1313796 -0.6659942 -0.097328 -0.0330135 -0.0343663 -0.365172 -0.3292372 0.1769271 0.127966 0.2107212 -0.8922489 0.0461544 0.1189778 0.0763751 -0.4890932 -0.7320275 -0.2269802 0.0356482 -0.286815 -0.4574494 -0.0855489 0.0091993 -0.0928827 -0.4975205 -0.7105536 -0.2584059 0.1016391 -0.3420076 -0.4248249 -0.119432 0.1108311 -0.1097319 -0.5214557 -0.8691599 0.1852684 -0.1344931 0.1026942 -0.5705111 0.0288128 -0.3200617 0.166044 -0.3215412 0.2601478 -0.302949 -0.0391507 -0.1052507 0.7011862 -0.0586114 -0.0595922 0.0190585 0.3334166 0.1960065 -0.1404767 0.0671226 -0.1286984 0.4347579 -0.0125392 0.2101195 -0.0721651 0.2704009 0.3056354 0.4718054 0.0266453 0.3557919 -0.2746314 0.1250776 0.0527373 0.1081749 0.3145653 0.8540729 -0.1333132 0.2436738 -0.2112842 0.7811466 -0.1222821 0.4295644 -0.2921404 0.1390046 0.2353201 -0.2166774 -0.1156787 -0.1904487 0.1671417 0.0411552 -0.1095681 0.1009313 0.3585135 0.4816309 0.2239465 0.0383025 0.2048609 0.3341486 0.0931761 -0.0342772 0.0646818 0.3861483 0.0069544 0.0337466 -0.0227817 0.0175085 -0.0092949 0.0258652 -0.016854 0.0272804 -0.1609059 0.0458767 0.0027321 0.03039 0.0429398 -0.0093888 -0.0373437 -0.0274595 0.0225509 -0.1627527 0.0370938 -0.0433551 -0.0582408 -0.0225891 0.048051 -0.0132967 -0.0572033 -0.0447394 -0.1020141 0.0306666 0.0533944 0.0011562 0.0343102 -0.0433644 0.0270694 0.0040277 0.0714314 0.0866207 0.0102575 -0.0016039 -0.0285019 -0.0019816 0.0886024 0.0319738 0.0363458 -0.0760111 -0.1429612 -0.0035785 -0.0557673 -0.0829198 -0.0532229 0.0511873 0.0040007 -0.0381689 -0.0524486 -0.1897408 0.063849 0.0541457 -0.0148898 0.0175534 -0.0397309 0.0139308 -0.0252962 0.0468208 0.0869657 0.1687498 -0.1373759 -0.0796493 -0.091666 0.3372863 -0.0025062 -0.1037723 0.0075249 0.3382389 0.2957174 0.0459236 -0.0368909 0.1855832 0.3088151 0.0705004 -0.0377753 0.0184905 0.3198334 0.3511625 0.1371062 -0.095317 0.1306215 0.1351159 0.0411718 -0.1087605 0.0451211 0.3194495 unknown
polarizability: 95.4481242|-3.6583718|85.4610804|3.5580968|0.2760036|58.1533254 unknown
InChI: InChI=1S/C6H10O5/c7-1-4-6(10)5(9)3(8)2-11-4/h4-7,9-10H,1-2H2
charge 0 multiplicity 1
21 atoms
O  0.762527 1.289853 -0.230915
O  0.42144 -2.38907 0.255675
O  -2.367848 -1.517287 0.001513
O  3.50662 0.604254 0.016633
O  -2.721817 1.169227 -0.333794
C  0.035849 -1.057087 -0.196187
C  1.145114 -0.075569 0.223608
C  -1.309228 -0.636062 0.454752
C  -1.609952 0.83238 0.153302
C  -0.455869 1.796182 0.425003
C  2.498263 -0.353245 -0.435969
H  -0.0936 -1.029535 -1.300256
H  1.258406 -0.077497 1.329584
H  -1.190076 -0.747985 1.555594
H  -0.665543 2.780651 -0.019271
H  -0.29549 1.902493 1.520949
H  2.379747 -0.325893 -1.540364
H  2.856613 -1.348731 -0.134322
H  -0.337291 -3.003114 0.076187
H  -3.096066 -0.947588 -0.375151
H  3.154203 1.512924 -0.169771
