program: Gaussian 09
title: 000126488
version: EM64L-G09RevD.01
frameworkgroup: C1[X(C6H12O8P2)]
method: RPBEPBE
basis: SDD
operation: Freq
keyword: #p
keyword: freq=noraman
keyword: PBEPBE/SDD
title: #p freq=noraman PBEPBE/SDD
converged: YES YES NO NO
title: Mulliken charges:
elementType: P P O O O O O O O O C C C C C C H H H H H H H H H H H H
charge: 1.195368 1.185226 -0.176490 -0.097918 -0.688780 -0.655954 -0.726638 -0.680325 -0.573752 -0.604248 -0.388556 -0.423505 -0.442193 -0.485665 -0.069673 -0.066779 0.236035 0.229142 0.272804 0.230331 0.294907 0.280958 0.274126 0.246947 0.408351 0.402917 0.417555 0.405810
chargesum: 0.00000
title: Mulliken charges with hydrogens summed into heavy atoms:
elementType: P P O O O O O O O O C C C C C C
charge: 1.195368 1.185226 -0.176490 -0.097918 -0.280430 -0.253038 -0.309083 -0.274515 -0.573752 -0.604248 0.076621 0.079630 0.133672 0.035408 -0.069673 -0.066779
polarizability: 1.65877804e+02 2.35722389e+00 1.36306235e+02 -6.08583455e+00 2.12628859e+00 1.16975815e+02
1716.lowfreq: -14.7415 -3.1823 -1.5284 0.0013 0.0013 0.0016 6.9290 27.0369 33.8166
frequency: 4.0215 26.8843 33.7813 53.9656 72.0528 84.9734 97.0655 110.1326 128.6872 143.8028 150.6711 172.4796 192.9753 203.3704 223.5712 237.3877 250.2564 258.0872 270.5639 283.8213 305.9507 322.4632 347.6114 366.4579 383.3462 425.2059 430.6720 452.9387 488.3583 534.5854 605.3085 633.1353 665.1474 688.3476 702.2434 718.4889 727.8605 788.5919 802.3178 871.9833 918.2299 957.9253 983.8623 988.2976 1011.2106 1013.0993 1049.2499 1052.5733 1056.0315 1065.8003 1116.9755 1137.7589 1153.3098 1185.3076 1219.5054 1282.0314 1314.7831 1319.6054 1341.8227 1366.9169 1406.3705 1425.9145 1470.5307 1486.0449 1651.7527 1667.0175 2960.8909 2989.7771 2995.9750 3000.7186 3021.9520 3038.3997 3062.3314 3077.2206 3363.6803 3583.3489 3590.7065 3596.3729
redmass: 7.8126 8.3258 7.0645 7.0400 5.9619 5.4915 4.1936 5.3965 9.1896 7.5778 3.4299 2.2182 3.5175 2.1095 2.5683 2.2174 2.8557 3.4382 2.4426 7.9003 2.4478 3.1956 5.2371 2.3002 3.5388 8.3177 10.6513 4.0882 3.3203 3.9857 4.1365 1.4770 2.7145 4.6400 3.0514 7.8730 9.3407 2.0343 1.9810 1.9216 2.9352 2.1096 1.8695 1.6641 2.0170 1.7229 2.3793 3.2107 2.9226 2.1139 2.6318 1.1477 1.1599 1.3785 1.2801 1.2519 1.2928 1.2013 1.5254 1.4628 1.0942 1.0976 1.0740 1.0864 9.1999 11.6689 1.0669 1.0607 1.0601 1.0612 1.0889 1.1006 1.1032 1.1021 1.0681 1.0660 1.0665 1.0663
irintensity: 1.4058 1.4952 1.4260 0.1854 27.5605 6.4323 16.7267 9.7067 2.5159 5.6021 46.1328 53.7200 38.0057 28.7428 19.3004 11.7618 17.2237 37.0614 15.1732 21.7546 67.4189 4.6668 62.9976 113.6226 6.2994 36.3361 46.4121 7.7076 1.1357 10.4122 8.5800 134.7425 123.7067 105.8565 93.4196 300.5358 165.2396 26.9999 6.0995 8.6827 16.9691 97.1983 103.7819 1.8781 5.6772 19.3169 15.9928 154.2475 19.0381 14.4930 21.8583 114.2889 27.9885 7.7751 9.0733 9.6129 4.4779 4.0717 22.6172 1.8297 73.7027 20.5011 4.0899 14.7384 236.2390 153.8435 16.7033 4.9478 15.7803 18.6720 2.5468 1.5698 11.9825 21.6941 898.8677 77.2094 84.5375 64.5423
temp: 298.150 k
press: 1.00000 atm
elementType: 15 15 8 8 8 8 8 8 8 8 6 6 6 6 6 6 1 1 1 1 1 1 1 1 1 1 1 1
symmnumber: 1
zpe: 503525.4 jmol-1
zpe.correction: 0.191783 hartree
zpe.thermalcorrener: 0.212461 hartree
zpe.thermalcorrenthalpy: 0.213405 hartree
zpe.thermalcorrgfe: 0.138960 hartree
zpe.sumelectzpe: -1518.775753 hartree
zpe.sumelectthermal: -1518.755075 hartree
zpe.sumelectthermalent: -1518.754131 hartree
zpe.sumelectthermalfe: -1518.828575 hartree
dipole: -4.6374 3.8218 0.5197
dipole: 6.0318
quadrupole: -121.6280 -97.0424 -121.8025
quadrupole: 0.1115 -10.5634 6.0015
quadrupole: -8.1371 16.4486 -8.3116 0.1115 -10.5634 6.0015
hfenergy: -1518.9675357 hartree
pointgroup: C01 [X(C6H12O8P2)]
dipole: 1.8387912 -1.4008422 0.5366394 debye
polarizability: 165.4780464|4.1870228|134.8693227|6.616057|-5.5079725|118.8124853 unknown
InChI: InChI=1S/C6H12O8P2/c7-5(15(9,10)11)3-1-2-4-6(8)16(12,13)14/h9-10,12-13H,1-4H2
charge 0 multiplicity 1
28 atoms
P  3.685096 0.562396 -0.123141
P  -2.754367 1.102519 -0.024678
O  1.016043 0.986808 -0.616975
O  -3.661434 -1.374361 -0.985746
O  4.141957 -0.686316 0.97746
O  3.674421 1.930449 0.940841
O  -1.636917 1.479249 -1.294762
O  -4.165599 1.706377 -0.794393
O  4.559886 0.752805 -1.441145
O  -2.397049 1.664914 1.424681
C  -0.035821 -1.71569 -0.186202
C  -0.771957 -1.289266 1.106637
C  1.471304 -1.390443 -0.142444
C  -2.302774 -1.57186 1.062459
C  1.801692 0.070061 -0.310228
C  -2.999894 -0.852545 -0.075394
H  -0.494267 -1.233234 -1.070754
H  -0.151836 -2.806282 -0.330791
H  -0.610703 -0.216761 1.325735
H  -0.357616 -1.846824 1.96842
H  1.955848 -1.739283 0.791528
H  2.022395 -1.925845 -0.947548
H  -2.742791 -1.208308 2.011869
H  -2.506188 -2.653084 0.962489
H  5.077048 -0.659851 1.303413
H  3.849653 2.799357 0.496416
H  -0.663621 1.420732 -1.061663
H  -3.97261 2.306987 -1.559683
