program: Gaussian 09
title: 000126556
version: EM64L-G09RevD.01
frameworkgroup: C1[X(C20H24O7)]
method: RPBEPBE
basis: SDD
operation: Freq
keyword: #pfreq=noraman
keyword: PBEPBE/SDD
title: #p freq=noraman PBEPBE/SDD
converged: NO NO NO NO
title: Mulliken charges:
elementType: O O O O O O O C C C C C C C C C C C C C C C C C C C C H H H H H H H H H H H H H H H H H H H H H H H H
charge: -0.252434 -0.319033 -0.329428 -0.433818 -0.223423 -0.456248 -0.211980 0.230301 0.295088 -0.196908 0.460238 0.272934 -0.257527 -0.217478 -0.357855 -0.251872 -0.497786 -0.234760 -0.531840 -0.835070 0.224551 -0.553889 0.021860 -0.334832 -0.697029 -0.444582 0.117661 0.250128 0.243196 0.244241 0.233031 0.275553 0.259078 0.223924 0.225218 0.207218 0.258871 0.279732 0.242720 0.230782 0.374675 0.252253 0.254661 0.204678 0.209435 0.264693 0.222530 0.207637 0.245361 0.242237 0.363309
chargesum: 0.00000
title: Mulliken charges with hydrogens summed into heavy atoms:
elementType: O O O O O O O C C C C C C C C C C C C C C C C C C C C
charge: -0.252434 -0.319033 -0.329428 -0.059143 -0.223423 -0.092939 -0.211980 0.230301 0.295088 0.053220 0.460238 0.272934 -0.014331 0.026763 -0.124823 0.023680 -0.014785 -0.009542 -0.065751 -0.081836 0.224551 -0.046976 0.021860 0.079280 -0.002169 0.043016 0.117661
polarizability: 2.78152682e+02 -7.56561399e+00 2.09339214e+02 -6.07786699e+00 8.86226963e+00 1.73684776e+02
1716.lowfreq: -48.1347 -6.5191 -0.0010 -0.0006 -0.0005 3.6319 14.8555 28.9524 47.9803
frequency: -48.1127 28.7360 47.9224 52.5934 87.8324 101.0180 118.3029 135.8018 154.8121 164.3997 172.8794 185.5561 198.0497 204.2860 215.3948 226.5844 234.2338 246.4010 255.4312 270.6070 283.9248 287.5658 324.0952 327.8986 340.4126 348.0674 366.8896 385.7348 408.7905 420.1141 435.5291 441.9947 444.6298 453.0157 460.2533 505.6510 518.7320 531.7522 535.2289 543.8859 574.7295 603.3233 621.2396 644.8040 672.5748 691.8103 699.6582 715.5243 724.3604 734.9436 772.1474 796.3039 806.4088 830.8426 844.9761 864.2308 874.8858 893.7545 913.7836 919.1996 943.0452 946.6806 948.7915 962.6353 968.8721 982.1014 992.5566 994.5581 1000.4533 1017.2644 1022.5194 1033.8001 1046.8831 1065.5748 1073.5147 1085.6642 1103.0122 1111.1765 1122.7596 1126.5004 1139.1281 1147.5101 1173.0578 1178.8115 1193.6649 1199.2754 1213.3184 1219.3311 1220.7146 1240.2405 1252.0619 1260.1642 1265.9430 1279.5355 1285.2469 1288.3787 1304.9787 1307.2283 1312.8505 1316.3758 1334.0557 1348.6975 1358.5751 1365.3335 1378.3946 1384.2499 1388.3438 1392.1155 1404.3307 1404.4935 1424.9683 1446.1797 1448.9621 1453.5916 1456.4047 1464.4270 1472.3473 1480.5815 1488.7170 1501.6617 1508.7193 1673.9676 1703.2326 2925.4085 2963.6156 2967.7511 2977.6196 2979.9791 2995.0051 2997.4205 2999.3138 3001.8595 3004.3845 3026.4823 3042.3405 3051.1658 3060.1952 3061.3053 3091.2297 3092.5293 3107.6331 3109.3338 3113.9494 3121.4823 3128.3617 3506.5378 3511.1137
redmass: 7.0500 6.4049 4.9760 5.3746 5.9501 4.3680 4.1502 4.2592 3.7398 4.0831 2.1138 1.4219 1.9714 2.2562 3.7328 3.7173 3.9709 2.9482 3.4525 2.8610 2.8952 3.3625 1.3330 3.2905 4.7346 2.9725 4.5832 3.4346 4.4946 1.5344 3.4802 3.5341 3.6579 3.1112 3.5502 4.5295 4.7132 4.5077 4.7608 4.1377 5.9679 4.2422 4.4075 3.6655 4.3764 4.9334 6.1690 5.8505 7.5250 3.9826 4.9622 4.2282 3.4298 4.0498 4.2843 2.6884 4.8672 2.1713 5.2585 2.5905 2.6055 1.8958 1.9748 2.7540 2.5052 2.0610 2.7493 3.2572 2.4552 1.9388 1.9921 1.9801 1.9601 1.9976 1.7627 2.1486 2.6324 2.0464 1.9509 1.4369 1.7495 1.8882 1.8508 1.7432 1.5538 1.2996 1.9049 1.4363 1.4054 1.7582 1.7880 1.4635 1.3788 1.7337 1.5952 1.5385 1.7027 1.4136 1.3296 1.4292 1.3903 1.6996 1.5469 1.5845 2.9024 1.5337 1.6467 1.3214 2.0471 1.2344 2.6251 1.0872 2.8651 1.0841 1.0836 1.0482 1.0916 1.0682 1.0697 1.0814 1.0534 9.1051 12.6683 1.0808 1.0821 1.0834 1.0636 1.0592 1.0622 1.0574 1.0367 1.0397 1.0576 1.1065 1.0968 1.1054 1.1012 1.1009 1.1001 1.0989 1.0910 1.0888 1.0993 1.0986 1.0907 1.0649 1.0669
irintensity: 25.7663 1.3027 4.5136 2.1302 1.4325 1.0826 7.2261 4.4875 6.3217 2.7132 1.0490 0.6891 0.4782 3.6423 1.4545 5.5892 7.7786 0.6910 5.4517 2.7110 6.9696 0.1927 144.5159 9.9627 6.5933 7.5887 2.2442 3.6123 0.5703 72.4393 39.0993 15.3585 18.8559 11.1859 7.6578 27.7846 13.9906 7.9974 12.4923 16.3487 3.7886 1.3645 9.2970 5.1723 2.9457 3.1302 6.8130 17.8798 18.1132 2.5605 6.3225 3.9346 13.9077 55.5130 2.6738 4.9022 19.1631 7.6724 86.0590 19.2586 20.2410 25.5377 7.8188 6.9444 10.4351 26.2775 32.0200 57.8755 1.6484 23.7401 8.8978 4.3302 35.8715 7.4571 3.2818 6.9826 14.2171 3.5246 0.6611 0.4622 8.2782 0.5583 15.4385 8.0492 0.7828 11.8097 4.5139 33.2171 33.6256 0.8673 8.4168 7.3530 15.4800 9.2543 2.9620 6.7611 6.4553 2.2067 0.3932 11.0432 5.9164 2.6461 13.4386 5.0823 6.0148 11.9930 15.8075 22.0593 2.6796 58.4391 14.3666 5.2893 3.0193 17.6408 12.9064 9.8190 5.5427 4.1288 14.1649 8.2649 5.6370 111.6193 371.1545 7.7820 6.7762 23.8831 26.6542 67.0360 9.1574 14.7864 35.1537 30.1292 25.4773 63.9032 12.0838 7.4522 0.8688 28.2917 39.2825 17.9132 20.4667 14.3630 12.5477 2.0531 18.1782 17.5886 43.1719
temp: 298.150 k
press: 1.00000 atm
elementType: 8 8 8 8 8 8 8 6 6 6 6 6 6 6 6 6 6 6 6 6 6 6 6 6 6 6 6 1 1 1 1 1 1 1 1 1 1 1 1 1 1 1 1 1 1 1 1 1 1 1 1
symmnumber: 1
zpe: 1071429.7 jmol-1
zpe.correction: 0.408086 hartree
zpe.thermalcorrener: 0.431944 hartree
zpe.thermalcorrenthalpy: 0.432888 hartree
zpe.thermalcorrgfe: 0.357102 hartree
zpe.sumelectzpe: -1300.929056 hartree
zpe.sumelectthermal: -1300.905198 hartree
zpe.sumelectthermalent: -1300.904254 hartree
zpe.sumelectthermalfe: -1300.980040 hartree
dipole: -3.8171 -0.0963 -0.3493
dipole: 3.8342
quadrupole: -211.8868 -160.6590 -158.2658
quadrupole: 10.8093 8.8472 11.6511
quadrupole: -34.9496 16.2782 18.6714 10.8093 8.8472 11.6511
hfenergy: -1301.3371419 hartree
pointgroup: C01 [X(C20H24O7)]
dipole: 1.50296 -0.0337349 0.1246366 debye
polarizability: 277.8674744|9.1101841|211.1576974|-5.59457|-4.5290851|172.1515006 unknown
InChI: InChI=1S/C20H24O7/c1-8(6-21)18-13(26-18)14-20(27-14)17(2)4-3-9-10(7-24-15(9)22)11(17)5-12-19(20,25-12)16(18)23/h8,11-14,16,21,23H,3-7H2,1-2H3
charge 0 multiplicity 1
51 atoms
O  0.974844 -2.155775 -0.744541
O  0.762348 0.896165 -2.336645
O  2.365721 0.271717 1.700901
O  3.279217 -0.262774 -1.939659
O  -5.336552 1.472457 0.640981
O  4.463795 2.247102 1.557321
O  -6.341184 -0.647648 0.756042
C  0.34752 -0.806222 -0.415412
C  1.119821 0.392066 -0.935065
C  1.031961 -1.600924 0.665361
C  3.199831 -0.177133 0.471934
C  -1.198053 -0.742889 -0.501517
C  2.362004 -1.174806 1.197414
C  0.403879 1.706877 -1.100697
C  2.654833 0.438032 -0.811827
C  -1.615099 0.673279 0.050373
C  -1.0840 1.848772 -0.813503
C  4.701375 -0.131432 0.765929
C  -1.877408 -1.82318 0.401707
C  -1.636924 -0.974973 -1.975605
C  -3.110151 0.7174 0.266438
C  -3.420767 -1.802306 0.281871
C  -3.908305 -0.382685 0.371433
C  5.231444 1.318857 0.717812
C  5.545055 -1.050734 -0.15034
C  -3.952093 1.964193 0.433826
C  -5.312236 0.031789 0.604681
H  0.411153 -2.162318 1.371101
H  2.864718 -1.874574 1.876477
H  1.014213 2.614402 -1.01615
H  2.953092 1.507065 -0.842275
H  -1.132541 0.779183 1.048781
H  -1.63017 1.912523 -1.77212
H  -1.249575 2.801222 -0.277096
H  4.803506 -0.491692 1.81209
H  -1.621588 -1.630386 1.462699
H  -1.487325 -2.820884 0.131737
H  -1.088049 -0.324561 -2.671468
H  -1.423438 -2.022118 -2.254262
H  -2.717343 -0.794999 -2.102321
H  2.751008 -0.017319 -2.746384
H  -3.877979 -2.412428 1.08296
H  -3.757721 -2.257373 -0.669115
H  6.286175 1.323757 1.053902
H  5.210278 1.697711 -0.323417
H  5.487105 -0.721621 -1.199851
H  5.186043 -2.094203 -0.12165
H  6.598321 -1.033366 0.180242
H  -3.672843 2.56658 1.318244
H  -3.955588 2.615556 -0.459414
H  3.779473 1.735517 2.064274
