program: Gaussian 09
title: 000126478
version: EM64L-G09RevD.01
frameworkgroup: C1[X(C18H22O2)]
method: RPBEPBE
basis: SDD
operation: Freq
keyword: #pfreq=noraman
keyword: PBEPBE/SDD
title: #p freq=noraman PBEPBE/SDD
converged: YES YES NO NO
title: Mulliken charges:
elementType: O O C C C C C C C C C C C C C C C C C C H H H H H H H H H H H H H H H H H H H H H H
charge: -0.436234 -0.436245 0.179567 0.179324 0.419709 0.420105 -0.773888 -0.774664 -0.774791 -0.773622 -0.322606 -0.318571 -0.317940 -0.322488 -0.406781 -0.445857 -0.446076 -0.406881 0.286764 0.286768 0.242397 0.225873 0.198603 0.225307 0.245715 0.198838 0.198012 0.244607 0.225217 0.199508 0.243457 0.225850 0.219693 0.218012 0.217538 0.219313 0.248618 0.217154 0.217181 0.248708 0.352408 0.352400
chargesum: 0.00000
title: Mulliken charges with hydrogens summed into heavy atoms:
elementType: O O C C C C C C C C C C C C C C C C C C
charge: -0.083825 -0.083845 0.179567 0.179324 0.419709 0.420105 -0.107015 -0.104805 -0.106955 -0.104807 -0.102914 -0.100559 -0.100402 -0.103175 -0.158163 -0.228703 -0.228896 -0.158173 0.286764 0.286768
polarizability: 2.98676027e+02 4.39324632e+00 1.86881038e+02 1.67897959e+01 5.39104846e-01 1.22483330e+02
1716.lowfreq: -26.5037 -4.8877 0.0004 0.0006 0.0009 7.3505 16.7191 43.1864 44.4317
frequency: 16.3388 43.1855 44.4299 61.9935 80.2208 168.9780 181.0843 200.0405 221.7289 257.0920 263.2054 269.2415 283.0091 287.9412 308.3530 321.8940 333.6011 352.3771 353.6201 364.8083 365.5861 371.7428 389.4649 396.6041 411.2701 411.5089 445.3909 445.9442 496.2949 499.7269 507.8596 551.2901 564.3036 611.4242 638.3121 638.3348 678.9040 733.1613 736.0926 763.9008 804.9615 805.3557 812.2984 816.8469 833.3491 834.8745 877.9732 922.0512 923.5111 934.2043 941.6591 947.1937 960.3855 962.6193 993.2249 1003.4343 1003.6939 1011.3308 1083.3210 1091.4494 1098.5360 1110.1944 1136.3080 1142.6235 1146.9749 1148.9875 1167.8829 1185.0684 1191.7752 1192.9113 1223.6502 1251.4800 1252.9463 1257.9407 1315.9393 1317.3579 1374.2764 1377.1480 1377.4804 1388.8315 1393.6344 1409.8241 1419.6160 1420.6819 1459.1763 1472.8290 1475.5374 1481.9109 1485.6047 1488.3982 1498.4528 1504.1397 1507.7354 1511.7293 1591.6214 1592.0859 1623.9137 1624.5087 2988.6143 2990.8525 2991.1286 2995.5744 3075.3041 3080.9977 3081.5624 3083.8607 3087.3745 3090.0927 3093.2898 3094.7126 3109.5772 3109.9797 3147.2818 3147.8422 3157.6407 3158.5050 3170.3355 3170.7083 3581.7900 3582.4436
redmass: 4.1825 3.8626 6.3612 3.3371 5.6289 6.1909 5.0369 2.9483 3.7587 1.2132 1.3133 1.5810 1.3155 2.3739 2.5372 2.5860 1.3552 1.1115 1.1113 2.8564 3.0724 3.8029 3.4054 3.6026 2.9261 2.9326 2.7643 3.2364 3.4258 3.2005 2.8732 3.5621 2.5574 3.6549 7.0663 7.0862 3.6324 3.9769 3.5659 2.5432 1.4798 1.4217 3.9561 4.1350 1.5749 1.5743 2.5184 1.4480 1.5836 1.3476 1.4341 1.7059 1.3560 1.3792 1.2629 3.0503 3.0688 1.2856 1.9477 2.1666 2.2473 1.6896 1.8986 2.0223 1.3562 1.4243 2.2012 2.8220 1.1319 1.1735 3.0899 2.3183 2.5684 3.9828 1.3702 1.3804 1.2076 4.7565 4.4779 1.2171 1.1981 1.1811 3.0895 3.0027 1.0571 1.0554 1.0572 1.0550 1.1901 1.0518 1.8734 1.3639 1.3748 1.2214 6.1797 6.1701 6.2666 6.3125 1.0356 1.0363 1.0360 1.0365 1.1000 1.0983 1.0984 1.0980 1.0995 1.0991 1.0981 1.0976 1.0894 1.0894 1.0871 1.0871 1.0926 1.0926 1.0962 1.0962 1.0660 1.0660
irintensity: 0.8820 1.6761 0.0471 0.0013 0.0005 0.0004 0.6672 0.0001 2.8334 0.0336 0.0865 0.0742 0.8740 0.1312 0.0148 0.3475 0.0451 89.6644 191.0649 2.8261 0.0441 20.1135 0.0018 0.0458 0.4472 0.7917 7.5891 7.5892 16.9395 0.4029 0.0068 0.0083 47.3170 0.0020 1.5995 0.0927 30.2391 0.0027 7.3018 0.0042 48.1494 1.3787 31.8566 0.0290 2.7276 78.9551 7.1413 0.0001 0.0021 0.2775 3.0070 0.0088 0.5188 0.0250 0.1266 23.3992 0.0517 0.0564 9.8121 83.6892 0.1015 0.0174 337.2283 19.7069 2.4620 234.5318 0.0134 0.0165 20.8812 0.6555 13.1098 1.0421 61.1108 0.0222 14.3359 0.0299 0.0068 0.4304 52.1680 43.3946 40.5108 0.0022 0.0036 20.3149 0.0040 4.5808 15.4118 1.5540 0.0673 0.2752 250.5746 0.0451 0.0108 24.2837 1.6502 18.4880 1.1453 73.3573 0.0226 34.8637 49.7841 0.0039 0.0493 16.1538 96.9294 0.0608 0.3673 27.8898 140.4957 0.0175 24.7184 16.6798 8.1666 12.4672 14.9533 20.9615 7.7236 5.4550 48.5351 35.4390
temp: 298.150 k
press: 1.00000 atm
elementType: 8 8 6 6 6 6 6 6 6 6 6 6 6 6 6 6 6 6 6 6 1 1 1 1 1 1 1 1 1 1 1 1 1 1 1 1 1 1 1 1 1 1
symmnumber: 1
zpe: 922579.1 jmol-1
zpe.correction: 0.351392 hartree
zpe.thermalcorrener: 0.370984 hartree
zpe.thermalcorrenthalpy: 0.371928 hartree
zpe.thermalcorrgfe: 0.304122 hartree
zpe.sumelectzpe: -848.063926 hartree
zpe.sumelectthermal: -848.044335 hartree
zpe.sumelectthermalent: -848.043391 hartree
zpe.sumelectthermalfe: -848.111196 hartree
dipole: 0.0095 0.0024 0.0502
dipole: 0.0512
quadrupole: -118.8387 -108.5314 -126.0342
quadrupole: 22.4872 2.2974 1.4999
quadrupole: -1.0373 9.2701 -8.2327 22.4872 2.2974 1.4999
hfenergy: -848.4153182 hartree
pointgroup: C01 [X(C18H22O2)]
dipole: -0.0034219 0.0010477 -0.0198128 debye
polarizability: 298.0309981|-5.1999148|186.9494318|19.5716334|-0.518528|123.0599642 unknown
InChI: InChI=1S/C18H22O2/c1-17(2,13-5-9-15(19)10-6-13)18(3,4)14-7-11-16(20)12-8-14/h5-12,19-20H,1-4H3
charge 0 multiplicity 1
42 atoms
O  -6.14025 -0.071266 -0.421569
O  6.141632 0.023599 0.419975
C  -0.421533 0.013656 0.694382
C  0.423182 0.008459 -0.699895
C  -1.945041 0.011693 0.399126
C  1.946611 -0.008262 -0.404723
C  -0.046025 -1.223931 1.562367
C  -0.050868 1.255516 1.558407
C  0.033866 -1.225242 -1.567228
C  0.066132 1.253967 -1.56447
C  -2.683225 -1.199149 0.27222
C  2.671982 -1.224242 -0.287757
C  -2.677501 1.219338 0.24226
C  2.691729 1.193875 -0.23781
C  -4.065233 -1.214338 0.000807
C  4.056777 -1.250324 -0.015278
C  -4.062453 1.228178 -0.03027
C  4.073583 1.191874 0.034505
C  -4.760087 0.004703 -0.153801
C  4.761269 -0.035737 0.149044
H  1.006415 -1.159452 1.8855
H  -0.681651 -1.254853 2.46608
H  -0.169922 -2.185726 1.036019
H  -0.678254 1.277961 2.468099
H  1.005067 1.203182 1.872389
H  -0.191322 2.216066 1.03423
H  0.148308 -2.188442 -1.041206
H  -1.01832 -1.15082 -1.888825
H  0.667679 -1.262011 -2.472017
H  0.218217 2.212978 -1.040802
H  -0.990559 1.212585 -1.877848
H  0.693418 1.26938 -2.474366
H  -2.176925 -2.161615 0.392958
H  2.157686 -2.181401 -0.415755
H  -2.169374 2.183529 0.339612
H  2.191542 2.162972 -0.328151
H  -4.61593 -2.155335 -0.090001
H  4.579861 -2.212732 0.063905
H  -4.591145 2.184406 -0.140731
H  4.629816 2.126068 0.156429
H  -6.530533 0.833684 -0.507569
H  6.526684 -0.885886 0.476657
