program: Gaussian 09
title: 000126441
version: EM64L-G09RevD.01
frameworkgroup: C1[X(C11H10ClN3O2)]
method: RPBEPBE
basis: SDD
operation: Freq
keyword: #p
keyword: freq=noraman
keyword: PBEPBE/SDD
title: #p freq=noraman PBEPBE/SDD
converged: YES YES NO NO
title: Mulliken charges:
elementType: Cl O O N N N C C C C C C C C C C C H H H H H H H H H H
charge: -0.053415 -0.266735 -0.252747 -0.431036 -0.391863 -0.657698 -0.679526 0.139029 0.488559 0.315692 0.096520 -0.356098 -0.467102 0.138173 -0.204107 -0.204304 -0.122082 0.231022 0.280539 0.334928 0.254504 0.251401 0.361675 0.257444 0.257427 0.365653 0.314147
chargesum: 0.00000
title: Mulliken charges with hydrogens summed into heavy atoms:
elementType: Cl O O N N N C C C C C C C C C C C
charge: -0.053415 -0.266735 -0.252747 -0.096107 -0.030187 0.022102 -0.167965 0.139029 0.488559 0.315692 0.096520 -0.101594 -0.215701 0.138173 0.053337 0.053123 -0.122082
polarizability: 2.14523576e+02 -1.06557674e+01 1.31139423e+02 1.26055856e+01 -3.20554610e+00 1.21280649e+02
1716.lowfreq: -5.0132 -2.3880 0.0015 0.0015 0.0024 6.8299 32.5465 37.0137 41.2109
frequency: 32.4953 37.0023 41.1972 92.9350 124.1289 165.8377 182.9719 194.3120 250.3058 255.1614 286.7804 317.0046 330.1380 348.2687 372.8040 403.1730 410.5289 470.7200 506.0388 522.2549 531.3634 575.3555 598.3145 615.4276 625.7503 632.7320 646.5938 697.5176 708.0243 722.4859 759.0172 786.3518 811.0835 835.1453 840.3726 914.6356 956.6487 967.6261 976.4248 999.9145 1042.6709 1072.1369 1096.5856 1113.0754 1179.2575 1182.8817 1196.7697 1227.5460 1260.6052 1297.4491 1322.5395 1327.1696 1352.1638 1375.1025 1395.0658 1397.3612 1460.6358 1477.4187 1502.1885 1582.9770 1597.6931 1611.9401 1630.5320 1653.3684 1683.3487 2967.7076 3023.7778 3118.9718 3138.6903 3167.9727 3171.0562 3522.2229 3541.8599 3553.0856 3669.4619
redmass: 6.1978 7.4760 5.4080 8.0293 7.4349 8.9460 4.5126 8.3065 3.9409 1.4923 4.9205 2.6180 3.7437 3.8378 7.0798 7.1681 2.9540 3.7210 4.6560 1.3271 4.0707 1.2031 4.4991 7.7786 6.8687 3.7046 4.3595 2.4883 4.1636 4.9005 2.7658 2.8424 4.4354 1.4332 1.5778 1.8796 1.4365 2.6360 1.3909 4.2514 2.3832 2.7830 1.7349 1.6556 1.9235 1.1154 2.6774 3.1693 2.3432 1.3710 1.8326 2.1136 1.8323 5.9820 2.6861 2.6260 1.1737 2.0747 5.1386 7.2757 6.1722 4.4274 1.9327 2.4159 4.9549 1.0617 1.0979 1.0898 1.0896 1.0947 1.0960 1.0479 1.0772 1.0778 1.1029
irintensity: 4.5239 2.5506 0.2634 0.2563 2.9033 3.0565 3.2069 3.8534 9.6016 22.6651 6.2738 5.6573 1.4007 3.5446 25.2614 16.1626 0.4395 5.0424 39.4581 176.6949 49.6954 85.7156 0.0969 1.1900 0.1308 23.5804 15.4716 4.9753 3.1327 32.1081 114.7806 38.8850 7.3673 18.7985 26.4311 8.9484 1.7424 15.8864 0.1037 38.5172 18.4932 40.3985 5.6576 28.8802 65.2624 1.4407 7.2096 5.7796 8.8265 7.0528 36.5027 5.2289 16.9735 1.2159 112.8921 17.9025 29.0810 78.9492 153.2515 1.9371 4.1688 189.1251 202.8106 450.7825 754.2722 28.3846 13.6431 10.3424 4.6450 5.7745 0.5951 142.0843 61.2363 52.0446 87.7930
temp: 298.150 k
press: 1.00000 atm
elementType: 17 8 8 7 7 7 6 6 6 6 6 6 6 6 6 6 6 1 1 1 1 1 1 1 1 1 1
symmnumber: 1
zpe: 523115.8 jmol-1
zpe.correction: 0.199244 hartree
zpe.thermalcorrener: 0.214368 hartree
zpe.thermalcorrenthalpy: 0.215312 hartree
zpe.thermalcorrgfe: 0.155509 hartree
zpe.sumelectzpe: -1198.776762 hartree
zpe.sumelectthermal: -1198.761638 hartree
zpe.sumelectthermalent: -1198.760694 hartree
zpe.sumelectthermalfe: -1198.820497 hartree
dipole: 2.1978 -4.0335 3.2484
dipole: 5.6260
quadrupole: -135.4574 -108.1488 -98.2412
quadrupole: 2.4940 -1.4237 -5.1707
quadrupole: -21.5083 5.8003 15.7079 2.4940 -1.4237 -5.1707
hfenergy: -1198.976006 hartree
pointgroup: C01 [X(C11H10Cl1N3O2)]
dipole: -0.6198294 2.0553083 0.5392263 debye
polarizability: 209.3732336|-25.6116922|137.7882775|-0.9943071|-1.9920712|119.7821371 unknown
InChI: InChI=1S/C11H10ClN3O2/c12-7-3-1-6(2-4-7)5-8-9(13)14-11(17)15-10(8)16/h1-4,14-15H,5,13H2
charge 0 multiplicity 1
27 atoms
Cl -5.252029 1.240757 -1.503428
O  1.867212 -2.607204 0.623924
O  4.896638 0.507428 -1.127204
N  2.848146 1.253402 -0.285592
N  3.353146 -1.032602 -0.240514
N  0.822191 2.140582 0.541208
C  -0.091756 -0.567056 1.378416
C  1.211408 -0.271659 0.657678
C  -1.359831 -0.101643 0.661151
C  1.603146 1.024521 0.315138
C  2.103852 -1.384066 0.372593
C  -1.581236 -0.423138 -0.704245
C  -2.355429 0.639151 1.34839
C  3.788017 0.243018 -0.588453
C  -2.760004 -0.021851 -1.367716
C  -3.544523 1.052321 0.70091
C  -3.726267 0.714616 -0.652157
H  -0.075677 -0.134797 2.399812
H  -0.121853 -1.666965 1.505721
H  3.14127 2.192502 -0.562538
H  -0.823914 -0.997343 -1.249976
H  -2.216293 0.881985 2.409551
H  3.993607 -1.806092 -0.43999
H  -2.927784 -0.279416 -2.417651
H  -4.309699 1.618811 1.23958
H  -0.1535 2.012113 0.80701
H  1.134063 3.078023 0.299982
