program: Gaussian 09
title: 000126411
version: EM64L-G09RevD.01
frameworkgroup: C1[X(C13H18O2)]
method: RPBEPBE
basis: SDD
operation: Freq
keyword: #pfreq=noraman
keyword: PBEPBE/SDD
title: #p freq=noraman PBEPBE/SDD
converged: YES YES NO NO
title: Mulliken charges:
elementType: O O C C C C C C C C C C C C C H H H H H H H H H H H H H H H H H H
charge: -0.284527 -0.218379 -0.195832 -0.440144 -0.127697 -0.434534 0.395342 -0.432828 -0.388345 -0.134699 -0.090291 -0.853870 -0.337716 0.179457 -0.715555 0.235508 0.205726 0.243400 0.235302 0.209716 0.205434 0.211796 0.212709 0.211779 0.257313 0.211034 0.222314 0.231623 0.226909 0.260800 0.230942 0.227522 0.239792
chargesum: 0.00000
title: Mulliken charges with hydrogens summed into heavy atoms:
elementType: O O C C C C C C C C C C C C C
charge: -0.284527 -0.218379 0.039676 0.008982 0.107606 -0.019383 0.395342 -0.008323 -0.176566 0.122614 0.120743 -0.173024 -0.076917 0.179457 -0.017299
polarizability: 1.89800218e+02 -3.19714165e+00 1.19723449e+02 -3.12066278e+00 -2.26869634e+00 1.19007462e+02
1716.lowfreq: -0.0002 0.0004 0.0008 6.3207 11.5677 17.3709 40.3328 56.0887 60.3656
frequency: 40.3126 55.5796 60.3385 96.0847 140.9709 176.6761 197.7184 201.8000 224.5253 245.9573 265.0985 298.9385 312.4649 357.3819 383.5606 396.3661 418.3336 434.7601 485.2072 512.9231 550.5414 584.6693 619.5917 674.4122 727.9799 762.8234 783.4465 803.4380 806.2000 842.0773 860.9954 881.3396 886.4289 927.1906 959.3806 996.6861 1007.6898 1017.1327 1028.0041 1047.3535 1066.1456 1072.1256 1090.0546 1094.6401 1110.8076 1119.7499 1145.7314 1155.7498 1171.1264 1203.5223 1226.9197 1240.2101 1248.1628 1267.7522 1288.8033 1303.5425 1308.4657 1324.1434 1330.6481 1343.6865 1349.2059 1358.6693 1373.6737 1388.0943 1401.2238 1458.4507 1458.9754 1469.0813 1470.3933 1473.7300 1475.4150 1478.1419 1589.8352 1627.0869 1681.7753 2884.9626 2891.4566 2947.2831 2950.4706 2957.6034 2976.0097 2981.2714 3007.2417 3009.3141 3025.9379 3043.9808 3066.1332 3076.6550 3089.8872 3107.6915 3108.1691 3117.2182 3150.7633
redmass: 5.1525 3.3609 3.4184 3.5947 3.2559 1.0973 1.7551 3.9683 2.7387 1.4852 3.4049 1.8577 2.6420 3.4092 3.9448 2.9566 3.9322 3.2964 4.0133 5.0960 3.9703 2.3031 2.5711 4.0425 3.1329 2.6892 3.0918 1.4022 2.3804 2.1677 2.4428 1.5948 2.2423 1.9047 2.3127 1.3404 1.7896 1.9275 1.8556 1.5609 2.1288 2.0581 2.1113 2.2663 1.7792 1.3482 1.9022 1.5292 2.1983 1.4838 1.5090 1.4940 1.3189 1.1949 1.3357 1.5537 1.4219 1.4727 1.6023 1.5012 1.5969 1.6425 1.8827 1.2248 1.2271 1.0877 1.0506 1.0792 1.0544 1.0881 1.0538 1.0609 9.9757 7.5635 6.9220 1.0803 1.0793 1.0807 1.0648 1.0390 1.0680 1.0630 1.0354 1.0917 1.0966 1.1012 1.0959 1.0974 1.0905 1.0882 1.1003 1.1002 1.0977
irintensity: 2.0130 0.3627 0.8800 2.7824 2.8685 0.1988 1.4502 1.5767 1.4652 0.4475 3.4419 3.0557 0.2435 2.7254 9.9303 0.6433 15.4038 0.5748 0.4268 2.5288 2.9914 4.6445 6.0196 2.3695 1.4326 7.1796 11.2025 7.9170 4.2713 28.9940 4.5347 8.1144 0.1855 6.3924 9.1482 3.7421 36.8853 19.0578 47.1766 6.8669 1.9551 4.0118 26.7028 16.9606 10.7322 1.6163 8.6184 11.8179 3.0237 4.1049 45.6852 1.8691 2.0885 10.8152 9.3149 14.9732 2.0895 6.9494 2.5498 0.8291 0.1736 1.4287 7.9404 33.7702 14.2836 2.6648 18.9997 18.8650 5.6025 7.4732 4.7504 16.2290 116.8139 95.3603 0.9867 59.4629 19.8847 10.7698 43.0405 47.2672 17.7429 41.4541 16.2087 58.6537 26.2883 56.3081 27.5104 24.6526 48.4311 4.3599 24.6501 10.1607 10.2290
temp: 298.150 k
press: 1.00000 atm
elementType: 8 8 6 6 6 6 6 6 6 6 6 6 6 6 6 1 1 1 1 1 1 1 1 1 1 1 1 1 1 1 1 1 1
symmnumber: 1
zpe: 733491.3 jmol-1
zpe.correction: 0.279372 hartree
zpe.thermalcorrener: 0.294143 hartree
zpe.thermalcorrenthalpy: 0.295087 hartree
zpe.thermalcorrgfe: 0.237615 hartree
zpe.sumelectzpe: -655.440672 hartree
zpe.sumelectthermal: -655.425901 hartree
zpe.sumelectthermalent: -655.424957 hartree
zpe.sumelectthermalfe: -655.482428 hartree
dipole: -3.5069 1.3627 -0.9841
dipole: 3.8889
quadrupole: -102.6411 -87.6165 -89.9644
quadrupole: 0.2816 -8.9190 -1.0840
quadrupole: -9.2338 5.7908 3.4429 0.2816 -8.9190 -1.0840
hfenergy: -655.7200437 hartree
pointgroup: C01 [X(C13H18O2)]
dipole: 1.394952 -0.5229629 -0.3487131 debye
polarizability: 189.6845966|-2.3291243|119.7056213|4.7769948|2.24609|119.1409116 unknown
InChI: InChI=1S/C13H18O2/c1-9-5-3-4-6-11(9)13-8-7-12(14)10(2)15-13/h5,7-8,10-11,13H,3-4,6H2,1-2H3
charge 0 multiplicity 1
33 atoms
O  -1.223346 0.46057 -0.99285
O  -4.094014 -0.198363 1.131752
C  1.161081 0.155354 -0.668085
C  1.252572 1.458808 0.166453
C  -0.234003 -0.513841 -0.5000
C  2.696731 1.995845 0.215493
C  2.311031 -0.818624 -0.3718
C  3.626029 0.966725 0.897573
C  3.403251 -0.43042 0.346424
C  -0.542126 -0.934332 0.921829
C  -2.619576 -0.000097 -0.827102
C  2.227926 -2.213991 -0.972262
C  -1.784319 -0.78781 1.469075
C  -2.923789 -0.299756 0.659333
C  -3.527216 1.07412 -1.423509
H  1.213849 0.425119 -1.746166
H  0.908034 1.257162 1.201292
H  0.559607 2.205536 -0.257998
H  -0.281098 -1.418473 -1.153548
H  2.729854 2.961436 0.754617
H  3.056248 2.186665 -0.815441
H  3.453312 0.971953 1.995477
H  4.688011 1.251173 0.758785
H  4.204597 -1.164374 0.518756
H  0.283914 -1.368963 1.501373
H  -2.748514 -0.963593 -1.37948
H  1.419332 -2.825162 -0.523883
H  3.174416 -2.763427 -0.829162
H  2.024599 -2.167653 -2.060923
H  -2.003529 -1.069277 2.505491
H  -3.335419 2.045465 -0.936684
H  -3.337509 1.177297 -2.504679
H  -4.583635 0.806529 -1.257949
