program: Gaussian 09
title: 000126444
version: EM64L-G09RevD.01
frameworkgroup: C1[X(C23H26N2)]
method: RPBEPBE
basis: SDD
operation: Freq
keyword: #pfreq=noraman
keyword: PBEPBE/SDD
title: #p freq=noraman PBEPBE/SDD
converged: YES YES NO NO
title: Mulliken charges:
elementType: N N C C C C C C C C C C C C C C C C C C C C C C C H H H H H H H H H H H H H H H H H H H H H H H H H H
charge: -0.094790 -0.408822 -0.238858 -0.468046 -0.395284 -0.427410 -0.361463 -0.354138 -0.335349 -0.126286 -0.554119 0.470042 0.410344 0.112567 -0.443491 -0.379826 0.228188 -0.449585 -0.418675 -0.226845 -0.224216 -0.352985 -0.265036 -0.269583 -0.227054 0.206884 0.212184 0.218266 0.207213 0.231751 0.201020 0.219570 0.192680 0.205616 0.196604 0.228422 0.217899 0.215742 0.204143 0.205048 0.227650 0.238966 0.267513 0.302854 0.231391 0.219016 0.249622 0.225658 0.223297 0.229383 0.222328
chargesum: 0.00000
title: Mulliken charges with hydrogens summed into heavy atoms:
elementType: N N C C C C C C C C C C C C C C C C C C C C C C C
charge: -0.094790 -0.105967 -0.031974 -0.037596 0.043680 -0.006821 0.036833 0.070887 -0.117450 0.089456 -0.144928 0.470042 0.410344 0.112567 -0.215841 -0.140860 0.228188 -0.182072 -0.187284 -0.007829 0.025406 -0.127328 -0.041739 -0.040200 -0.004725
polarizability: 2.50957677e+02 6.40765824e+00 3.07048140e+02 -2.18356823e+01 8.93524686e+00 1.93509272e+02
1716.lowfreq: -7.6645 -1.6186 -0.0004 0.0005 0.0007 7.1701 14.7745 19.8566 32.2148
frequency: 14.7251 19.4695 32.1308 37.7611 51.6820 53.8914 73.8339 109.8305 111.9989 129.2603 160.5441 208.0620 215.3978 219.5674 225.8078 243.8203 250.7816 287.6670 341.5397 359.5019 384.9441 408.9807 422.4629 428.1626 451.2529 460.4251 492.1999 498.7442 531.1924 537.9220 553.5759 575.9031 579.9111 615.9817 628.4482 635.9994 698.5097 704.3568 711.5684 726.8323 740.9065 750.7750 751.2722 760.1541 768.6879 771.2793 799.8701 808.6636 820.7216 851.3476 862.4211 866.5080 877.9558 893.6767 914.1672 924.7419 931.8729 938.0950 967.6190 972.9282 979.2363 989.9664 1001.5714 1003.4161 1010.3641 1022.9062 1030.5920 1038.9348 1043.2072 1069.7956 1078.9341 1083.7293 1090.5747 1096.6889 1117.7997 1133.2216 1153.1458 1163.9164 1167.7946 1170.9295 1179.8061 1187.2058 1214.1181 1226.0622 1234.7554 1239.2120 1247.5841 1259.1595 1272.2554 1276.6838 1286.9486 1296.9409 1298.0191 1325.2485 1329.6624 1331.4416 1337.5861 1342.9276 1349.4416 1365.2264 1380.2960 1382.1396 1391.4149 1417.3362 1421.4590 1437.6920 1454.1105 1456.5754 1459.4503 1463.6610 1466.6152 1479.1925 1481.2839 1482.4181 1485.6657 1563.5598 1586.6607 1589.4271 1608.8264 1630.8954 1651.1223 2928.9994 2947.6643 2958.3981 2960.4019 2962.6330 2978.2641 2996.8210 3002.8153 3013.7782 3023.5788 3033.8620 3052.1558 3061.1577 3103.6326 3119.6426 3120.3182 3121.0641 3127.7281 3128.8775 3140.2818 3142.3090 3157.2212 3159.8206 3161.0891 3217.4569 3613.7715
redmass: 5.4135 4.6254 4.4183 4.8551 3.8694 4.4323 4.6728 2.5280 3.1927 2.9253 3.0509 3.3967 3.6299 3.8189 2.8212 3.0521 3.5352 3.3215 2.4305 2.4898 3.8182 2.8883 2.8583 3.1783 3.5346 3.4339 2.9690 1.2449 3.4910 4.6690 3.3563 3.1527 4.6023 6.2596 3.6170 3.1181 1.9083 2.2619 1.6805 3.4447 1.8304 2.3137 1.5834 2.3036 2.2671 2.2688 1.5595 2.4275 1.7151 1.4702 1.2461 4.9331 2.8740 1.5962 1.2806 1.4362 1.3791 2.6264 2.3320 1.2966 1.3670 6.0264 2.2228 1.5426 2.1218 2.2102 2.2927 2.3566 2.1668 2.5125 1.6328 2.5744 2.0906 1.7211 1.3322 1.4798 1.2694 1.6333 1.1029 1.0936 1.6179 1.2944 1.2923 1.2820 1.9457 1.8378 1.6075 1.3418 1.5040 1.4625 1.1504 1.6091 1.5318 1.5597 1.3157 1.3193 1.4438 1.4009 1.7751 1.4147 1.4887 6.7510 5.3699 1.8585 2.3243 2.1771 1.1034 1.0853 3.8306 1.1155 1.1139 2.2006 2.8659 1.1239 1.1552 6.2963 6.1992 6.0771 6.0910 6.8874 6.1668 1.0675 1.0622 1.0817 1.0618 1.0617 1.0625 1.0637 1.0968 1.0990 1.0913 1.0980 1.1027 1.1037 1.0870 1.0869 1.0853 1.0860 1.0889 1.0904 1.0953 1.0950 1.1011 1.0962 1.1000 1.0982 1.0809
irintensity: 0.2024 0.0304 0.0061 0.0291 0.7944 0.4638 1.1822 0.4066 0.5381 0.6598 0.4405 0.5714 1.1964 9.1149 0.2585 4.1497 0.4505 2.0553 1.7917 4.6882 3.5008 0.1614 17.9117 7.1547 3.8617 1.1238 8.3418 90.4681 5.0811 0.1026 10.6009 6.8553 4.4653 0.0758 1.4362 0.9752 25.5176 29.3147 36.3065 0.3385 7.4620 38.4938 95.0410 6.5956 30.4584 19.0681 14.5379 13.3933 4.4208 2.0000 0.3360 0.2369 1.8999 1.2836 0.4751 3.2101 2.7830 8.0181 2.5214 0.0800 0.0844 0.0431 26.4998 12.5665 9.0609 13.4389 4.5253 2.1530 4.9492 5.9175 5.7496 2.2426 17.3424 17.9749 13.1901 1.3572 5.2735 28.8173 0.1888 1.6905 22.1895 4.6133 4.8635 21.5169 9.2388 20.7703 4.6245 9.1481 3.2913 2.3419 4.8983 18.8639 26.0601 15.1227 3.5240 3.7443 23.6424 10.2171 21.2224 23.3004 15.5236 1.0612 34.7124 19.1811 3.2862 12.6513 9.6421 3.5973 18.0209 9.1790 3.3211 14.7078 3.0443 11.8373 12.8855 2.0487 0.0958 0.5708 9.7916 2.6446 140.6364 46.6709 30.8326 33.8559 6.2965 109.8983 71.7976 34.1944 18.1246 3.6689 44.4780 26.9759 92.1579 37.4425 10.2726 9.0385 6.2305 7.2192 2.0806 6.7581 37.2800 39.7900 21.9246 21.0407 28.3681 1.6982 60.4817
temp: 298.150 k
press: 1.00000 atm
elementType: 7 7 6 6 6 6 6 6 6 6 6 6 6 6 6 6 6 6 6 6 6 6 6 6 6 1 1 1 1 1 1 1 1 1 1 1 1 1 1 1 1 1 1 1 1 1 1 1 1 1 1
symmnumber: 1
zpe: 1134890.4 jmol-1
zpe.correction: 0.432257 hartree
zpe.thermalcorrener: 0.454351 hartree
zpe.thermalcorrenthalpy: 0.455295 hartree
zpe.thermalcorrgfe: 0.378315 hartree
zpe.sumelectzpe: -999.737071 hartree
zpe.sumelectthermal: -999.714978 hartree
zpe.sumelectthermalent: -999.714033 hartree
zpe.sumelectthermalfe: -999.791013 hartree
dipole: 2.1077 -2.0742 -2.6318
dipole: 3.9587
quadrupole: -138.8819 -137.4445 -143.7711
quadrupole: 2.0152 -9.2413 0.4250
quadrupole: 1.1506 2.5880 -3.7386 2.0152 -9.2413 0.4250
hfenergy: -1000.1693282 hartree
pointgroup: C01 [X(C23H26N2)]
dipole: -0.8465341 0.8030229 -1.0316339 debye
polarizability: 249.7931366|3.622628|307.7850486|23.1780414|-5.4351508|193.936903 unknown
InChI: InChI=1S/C23H26N2/c1-2-8-19(9-3-1)20-13-16-25(17-14-20)15-7-6-10-21-18-24-23-12-5-4-11-22(21)23/h1-5,8-9,11-13,16,18,20,24H,6-7,10,14-15,17H2
charge 0 multiplicity 1
51 atoms
N  2.401817 2.490656 0.065518
N  -4.449547 0.186366 -1.525547
C  3.827937 -0.108335 0.276755
C  3.874734 0.802665 -0.995591
C  2.592621 1.653704 -1.135001
C  1.614321 3.732895 -0.003233
C  0.156647 3.624746 0.519284
C  -0.697135 2.552734 -0.190174
C  3.374248 0.726923 1.462308
C  2.743792 1.93495 1.300064
C  -2.183461 2.592314 0.265579
C  2.999387 -1.378584 0.018538
C  -3.011881 1.445034 -0.259487
C  -3.030287 0.085726 0.260563
C  3.616689 -2.505538 -0.587042
C  1.614812 -1.450071 0.31446
C  -3.941045 -0.680532 -0.552106
C  -3.89015 1.462844 -1.342755
C  -2.374639 -0.555592 1.345459
C  2.872857 -3.665697 -0.896337
C  0.862095 -2.605592 0.000545
C  -4.203748 -2.047692 -0.312277
C  1.488401 -3.717723 -0.607219
C  -2.633946 -1.918003 1.592467
C  -3.538071 -2.656758 0.771314
H  4.870935 -0.440873 0.463259
H  4.004433 0.186306 -1.904152
H  4.74413 1.482638 -0.914407
H  2.67199 2.314214 -2.019245
H  1.721903 0.980955 -1.298971
H  1.597617 4.057155 -1.061623
H  2.135428 4.529564 0.568698
H  -0.321247 4.621381 0.406508
H  0.175191 3.41047 1.607602
H  -0.652438 2.693271 -1.289251
H  -0.277826 1.549124 0.013892
H  3.589228 0.370586 2.474096
H  2.485061 2.549579 2.171184
H  -2.20942 2.588996 1.375106
H  -2.626578 3.557178 -0.050784
H  4.69096 -2.471792 -0.813447
H  1.134185 -0.598296 0.810143
H  -4.161104 2.290962 -1.995868
H  -5.125289 -0.063352 -2.243596
H  -1.680516 0.000987 1.986079
H  3.36972 -4.526992 -1.358624
H  -0.209682 -2.631389 0.228595
H  -4.898793 -2.619286 -0.937891
H  0.907101 -4.615289 -0.848112
H  -2.139052 -2.422789 2.429707
H  -3.719688 -3.71525 0.989118
