program: Gaussian 09
title: 000126454
version: EM64L-G09RevD.01
frameworkgroup: C1[X(C19H17ClO6)]
method: RPBEPBE
basis: SDD
operation: Freq
keyword: #p
keyword: freq=noraman
keyword: PBEPBE/SDD
title: #p freq=noraman PBEPBE/SDD
converged: YES YES NO NO
title: Mulliken charges:
elementType: Cl O O O O O O C C C C C C C C C C C C C C C C C C C H H H H H H H H H H H H H H H H H
charge: -0.080365 -0.306323 -0.443758 -0.245076 -0.267144 -0.260638 -0.409705 -0.102204 0.272185 -0.508632 0.084082 0.278246 0.042043 -0.655113 -0.706064 0.079347 -0.585538 0.233005 0.078597 0.212563 0.096630 0.163430 -0.400732 -0.378379 -0.217961 -0.523032 0.264025 0.258955 0.267269 0.284439 0.290874 0.227833 0.242830 0.237294 0.282458 0.358130 0.282723 0.225249 0.234432 0.230222 0.208377 0.292345 0.363081
chargesum: 0.00000
title: Mulliken charges with hydrogens summed into heavy atoms:
elementType: Cl O O O O O O C C C C C C C C C C C C C C C C C C C
charge: -0.080365 -0.306323 -0.085628 -0.245076 -0.267144 -0.260638 -0.046623 0.161820 0.272185 0.017592 0.084082 0.278246 0.042043 -0.079800 0.001893 0.079347 -0.303080 0.233005 0.078597 0.212563 0.096630 0.163430 -0.118009 -0.153131 0.016471 0.207912
polarizability: 3.50378902e+02 -6.73020398e+00 2.79019161e+02 8.67435310e+00 8.00256952e+00 1.34264253e+02
1716.lowfreq: -9.6708 -4.5154 -2.7670 -0.0020 -0.0012 -0.0011 24.0043 31.3341 39.6936
frequency: 23.9752 31.3287 39.6867 56.6448 65.5626 79.3786 91.7839 111.2943 121.4912 160.0996 167.7467 174.3249 183.4896 195.4224 212.0792 230.6944 239.3004 253.3954 272.8520 281.4451 291.3407 301.6994 328.6594 349.1253 357.2401 360.9087 368.0036 403.5674 418.8697 432.4315 474.7699 490.1878 494.1796 503.1529 510.2583 540.8940 551.3880 580.0875 595.0200 617.0475 623.6694 645.0941 656.5217 678.8263 689.8215 716.3800 722.2475 762.3156 770.2220 799.6457 812.8345 824.9708 831.8277 861.2300 871.6843 885.5895 893.2278 907.5246 946.9222 959.0063 971.9854 976.3763 978.9499 1024.8698 1038.9558 1057.5873 1067.5636 1095.3146 1108.2229 1130.5874 1139.4861 1145.6705 1151.8745 1167.2054 1173.4704 1186.5815 1208.2734 1225.9103 1228.2977 1252.2329 1259.2772 1267.7957 1272.1658 1294.6548 1306.7087 1323.5783 1360.3795 1367.5140 1391.1356 1394.3625 1411.1748 1427.1534 1437.5653 1446.7310 1451.8527 1455.5477 1465.5452 1475.4555 1478.0792 1482.8413 1486.3659 1547.6889 1581.6140 1600.6036 1621.1395 1644.8047 2982.7191 2999.1460 3006.5562 3037.8027 3066.0666 3080.7160 3096.3706 3105.5074 3114.8371 3122.5036 3128.1430 3155.2372 3156.9965 3176.7825 3195.9775 3499.0870 3580.1644
redmass: 7.8543 6.7527 4.3363 6.5249 4.6344 5.8062 3.2526 2.9291 2.1153 3.7058 1.9929 3.7131 1.7807 4.9569 5.1107 4.2467 4.7452 5.8914 3.6676 3.1019 5.4939 4.8111 4.3777 3.0069 4.2258 1.6395 4.8324 3.9398 5.4529 5.5769 1.4560 3.6474 2.9993 5.3786 9.5804 3.9922 4.3065 5.1768 5.5199 6.8070 3.8228 7.8074 6.7502 5.6835 5.8535 4.8990 3.5164 4.4021 1.9722 6.8640 3.2679 3.9038 5.9638 1.6213 5.4506 1.9776 1.4208 2.6841 4.9802 2.0877 1.8051 3.7675 1.3639 6.0424 2.4331 1.6567 1.9033 3.1723 1.3177 1.9251 1.4243 1.4914 1.4654 1.2540 1.3624 1.6764 3.4371 2.0791 1.9861 1.7923 1.4974 1.2898 2.1907 3.6325 3.4123 1.6445 3.1806 2.1871 4.4372 1.4254 8.6163 1.3929 1.0994 1.1405 2.7794 1.1419 1.0754 3.2386 2.3621 1.2211 1.1446 7.3191 8.3229 8.9732 7.8277 9.3775 1.0316 1.0646 1.0359 1.0866 1.0560 1.0981 1.1004 1.0996 1.1003 1.0894 1.1053 1.0905 1.1121 1.0975 1.0931 1.0650 1.0662
irintensity: 0.1073 1.3258 1.3058 0.7821 1.2194 0.6776 5.5726 3.7204 0.9562 0.0607 4.0162 6.8712 2.8824 2.6420 2.2287 9.2145 4.4113 2.5534 1.3046 3.0699 4.7875 4.7767 7.9207 43.8200 28.0407 80.8211 3.7774 16.5407 9.8074 6.6412 188.5836 13.0465 41.4546 9.9706 9.5891 6.8678 0.8169 37.5587 3.1183 5.0730 7.6511 5.8430 9.2215 44.6175 6.3716 25.0071 17.8227 21.5001 56.4471 2.1609 10.5853 16.9225 15.4416 34.9779 17.8875 60.1751 0.2197 33.7179 71.2434 31.5122 5.8974 10.5901 3.5333 93.5718 9.6156 34.8661 83.0394 257.8663 71.0859 20.7508 52.1105 28.8718 32.8943 24.8592 13.3510 56.1067 108.9210 2.4142 0.9989 94.0556 23.5415 2.2122 65.9805 44.8020 174.3762 22.0780 142.0204 113.1935 20.6498 47.7647 1.2829 34.2320 28.6411 25.2988 10.1146 12.8733 5.2249 61.1157 67.3763 50.2585 75.2944 335.2740 203.0247 48.8390 213.7509 158.8556 72.4436 6.9485 12.3026 8.4640 10.8624 7.0093 33.4125 21.4625 13.6522 13.5107 9.9443 8.7012 6.8528 13.9893 0.0700 19.8696 42.8119
temp: 298.150 k
press: 1.00000 atm
elementType: 17 8 8 8 8 8 8 6 6 6 6 6 6 6 6 6 6 6 6 6 6 6 6 6 6 6 1 1 1 1 1 1 1 1 1 1 1 1 1 1 1 1 1
symmnumber: 1
zpe: 842805.9 jmol-1
zpe.correction: 0.321008 hartree
zpe.thermalcorrener: 0.344873 hartree
zpe.thermalcorrenthalpy: 0.345817 hartree
zpe.thermalcorrgfe: 0.267143 hartree
zpe.sumelectzpe: -1643.732511 hartree
zpe.sumelectthermal: -1643.708646 hartree
zpe.sumelectthermalent: -1643.707702 hartree
zpe.sumelectthermalfe: -1643.786376 hartree
dipole: 1.9454 -3.8634 -1.7237
dipole: 4.6564
quadrupole: -153.8643 -139.9288 -163.5012
quadrupole: -17.0270 -12.0198 -1.7866
quadrupole: -1.4329 12.5026 -11.0698 -17.0270 -12.0198 -1.7866
hfenergy: -1644.0535192 hartree
pointgroup: C01 [X(C19H17Cl1O6)]
dipole: 0.8864244 1.4444317 0.6956345 debye
polarizability: 350.4503613|2.2274654|277.8697325|-13.2789589|12.3687786|135.3422219 unknown
InChI: InChI=1S/C19H17ClO6/c1-19(23,8-20)14-6-10-12(25-14)7-13(24-2)15-16(22)9-4-3-5-11(21)17(9)26-18(10)15/h3-5,7,14,21,23H,6,8H2,1-2H3
charge 0 multiplicity 1
43 atoms
Cl -6.413815 0.511843 1.603284
O  -3.127327 -0.885609 0.020593
O  -4.16262 0.935945 -1.851467
O  1.078897 1.162521 0.25939
O  0.688373 -3.821654 -0.144019
O  3.21722 -2.322311 -0.64677
O  2.292837 3.536699 0.631547
C  -3.301415 0.578038 0.431857
C  -4.471506 1.123961 -0.415427
C  -1.914004 1.243959 0.206043
C  -0.990983 0.043948 0.149264
C  -1.746263 -1.13459 0.008013
C  0.400622 -0.06116 0.136006
C  -5.768519 0.318875 -0.171839
C  -4.670724 2.630895 -0.215519
C  1.079681 -1.324541 -0.01941
C  -1.17183 -2.406847 -0.096359
C  0.2413 -2.505748 -0.078833
C  2.539178 -1.310503 -0.262596
C  3.221645 0.005539 -0.076179
C  2.4750 1.175285 0.19176
C  3.113578 2.43191 0.37242
C  4.635876 0.095257 -0.174892
C  4.518069 2.498941 0.279437
C  5.276232 1.330943 0.004704
C  1.770353 -4.307686 0.740335
H  -3.581709 0.557115 1.500285
H  -1.660192 1.947574 1.015122
H  -1.88973 1.798434 -0.751207
H  -6.573702 0.687687 -0.822457
H  -5.607072 -0.76161 -0.29905
H  -4.928365 2.860457 0.831873
H  -3.759378 3.182293 -0.4982
H  -5.492948 2.97867 -0.863815
H  -1.768163 -3.319536 -0.142229
H  -3.848816 -0.00193 -1.967637
H  5.18854 -0.822291 -0.395146
H  5.024769 3.462895 0.416986
H  6.365926 1.403767 -0.066235
H  1.579818 -5.387738 0.837321
H  1.707847 -3.819192 1.730938
H  2.747616 -4.106468 0.277215
H  2.837701 4.356862 0.730493
