program: Gaussian 09
title: 000126399
version: EM64L-G09RevD.01
frameworkgroup: C1[X(C19H10N2O3)]
method: RPBEPBE
basis: SDD
operation: Freq
keyword: #p
keyword: freq=noraman
keyword: PBEPBE/SDD
title: #p freq=noraman PBEPBE/SDD
converged: YES YES NO YES
title: Mulliken charges:
elementType: O O O N N C C C C C C C C C C C C C C C C C C C H H H H H H H H H H
charge: -0.301735 -0.216291 -0.225303 -0.135639 0.016435 0.137341 0.050032 0.396280 0.135774 0.290849 0.493187 0.243800 0.128082 -0.430309 -0.459539 -0.414283 -0.470704 0.205967 -0.476127 -0.343932 -0.445031 -0.365903 -0.258800 -0.227395 0.230411 0.311322 0.307716 0.257454 0.256071 0.230792 0.292521 0.307168 0.237481 0.242305
chargesum: 0.00000
title: Mulliken charges with hydrogens summed into heavy atoms:
elementType: O O O N N C C C C C C C C C C C C C C C C C C C
charge: -0.301735 -0.216291 -0.225303 -0.135639 0.016435 0.137341 0.050032 0.396280 0.135774 0.290849 0.493187 0.243800 0.128082 -0.199898 -0.148216 -0.106567 -0.213250 0.205967 -0.220056 -0.113140 -0.152510 -0.058735 -0.021319 0.014910
polarizability: 5.26993385e+02 1.69737987e-01 2.88958135e+02 -4.58477613e-03 -9.61694229e-03 8.27041326e+01
1716.lowfreq: -7.9303 -7.4538 -0.0006 0.0007 0.0008 3.5761 19.8412 47.3153 56.6852
frequency: 19.6957 47.3145 56.6847 100.7554 130.9343 157.7541 169.4069 217.6570 252.8642 260.4602 287.5505 302.2023 340.4785 351.9940 365.0937 388.1685 427.0892 435.5309 465.4084 476.7811 505.3987 521.6344 522.3673 537.0343 560.0398 570.3168 587.4510 614.5879 641.9893 642.6843 676.6927 694.1035 696.5707 700.7025 726.6403 758.5334 779.3855 780.5630 801.3418 815.1053 828.1943 856.6964 871.8186 882.7725 886.4897 894.9112 973.9848 993.7109 994.0157 1001.7404 1004.8539 1006.5532 1027.4108 1046.9448 1093.6074 1129.6916 1135.2919 1153.6944 1173.9288 1175.5338 1185.5059 1192.5456 1199.7162 1247.6291 1253.7276 1260.0349 1299.4354 1321.5071 1338.0997 1343.5202 1388.6730 1396.6065 1405.5287 1418.5174 1428.2523 1432.7633 1458.2201 1488.5155 1493.4338 1506.2844 1551.1844 1571.8720 1591.6608 1598.7627 1612.8788 1623.9419 3141.4634 3144.8374 3148.8858 3154.6356 3161.1634 3173.3263 3188.4272 3188.8623 3190.8333 3216.9725
redmass: 14.9989 7.7624 5.7193 4.9770 4.8731 8.0480 5.2076 4.7083 7.9829 5.3835 10.0775 4.7547 8.0171 4.9280 7.3836 9.8363 3.7254 7.8089 6.8476 3.6705 3.7120 4.8337 7.0064 7.6161 3.4937 6.5765 5.9824 4.7018 7.2490 7.2844 5.7695 7.4264 3.7808 4.5616 7.0669 3.0628 7.5174 1.4391 6.1323 3.5909 1.6334 1.6263 5.9493 1.5453 1.6482 6.3263 1.3734 5.4393 1.3285 1.3454 1.3292 1.3455 2.9874 3.1032 2.7141 1.7873 2.0531 2.4095 2.6375 1.2194 1.6277 2.1048 1.8686 2.5263 2.5713 1.5882 4.7421 3.0839 3.1911 3.4794 3.2082 4.7326 4.9619 3.6399 3.6037 3.5391 3.1075 5.4827 5.5412 3.8096 6.9912 5.9832 7.7406 7.0439 6.6284 7.0808 1.0865 1.0905 1.0906 1.0913 1.0905 1.0958 1.0941 1.0950 1.0962 1.0934
irintensity: 0.0083 3.0610 3.0927 0.5221 1.0498 2.3001 0.9565 1.5901 1.5948 7.1537 1.1616 0.0691 4.3454 0.0682 0.6142 2.3230 1.0131 1.7056 9.1481 2.1573 1.6252 1.4393 6.6319 2.6805 2.0066 4.2540 2.0118 3.4542 6.8304 0.9273 16.3502 1.4916 3.6062 0.0919 6.4307 26.5874 8.8085 75.9220 0.9860 0.8411 0.2811 27.7064 2.1373 14.5516 77.0683 10.4293 3.2289 26.8916 0.1947 0.0935 1.1281 1.9248 5.5107 21.4416 30.6711 0.6792 0.1208 99.0232 701.1470 58.7498 2.2485 127.4773 124.0600 41.2999 35.0405 16.2035 61.6597 60.4633 1.6273 38.4332 22.4794 39.5269 2.0714 8.0123 2.5433 9.1069 37.8864 1.0927 60.7207 1.6252 1.0015 19.7837 18.5422 48.7009 40.1578 30.9951 4.1131 4.9993 12.0551 4.1862 14.0378 21.4448 4.5512 6.4582 8.6099 9.1786
temp: 298.150 k
press: 1.00000 atm
elementType: 8 8 8 7 7 6 6 6 6 6 6 6 6 6 6 6 6 6 6 6 6 6 6 6 1 1 1 1 1 1 1 1 1 1
symmnumber: 1
zpe: 639027.4 jmol-1
zpe.correction: 0.243393 hartree
zpe.thermalcorrener: 0.259993 hartree
zpe.thermalcorrenthalpy: 0.260937 hartree
zpe.thermalcorrgfe: 0.198419 hartree
zpe.sumelectzpe: -1063.533359 hartree
zpe.sumelectthermal: -1063.516758 hartree
zpe.sumelectthermalent: -1063.515814 hartree
zpe.sumelectthermalfe: -1063.578333 hartree
dipole: -4.5026 0.7510 0.0007
dipole: 4.5648
quadrupole: -152.5966 -126.1030 -140.5559
quadrupole: 32.4860 0.0058 0.0013
quadrupole: -12.8447 13.6488 -0.8041 32.4860 0.0058 0.0013
hfenergy: -1063.7767516 hartree
pointgroup: C01 [X(C19H10N2O3)]
dipole: 1.7638217 -0.3381357 0.000295 debye
polarizability: 526.8628628|-5.5749951|289.088657|0.0048156|0.0095035|82.7041326 unknown
InChI: InChI=1S/C19H10N2O3/c22-20-15-4-2-1-3-12(15)13-7-8-14-16(21(23)24)9-5-11-6-10-17(20)19(13)18(11)14/h1-10H
charge 0 multiplicity 1
34 atoms
O  3.324001 -2.515022 -0.000048
O  -5.691632 1.034403 -0.000936
O  -4.082171 2.63673 0.000743
N  2.544557 -1.435746 0.000055
N  -4.443869 1.390894 0.000211
C  0.309954 -0.396314 0.00014
C  -1.121479 -0.576966 0.00017
C  0.882981 0.914167 0.000163
C  1.154136 -1.564887 0.000084
C  -1.999627 0.580032 0.000246
C  -1.664006 -1.914708 0.000127
C  2.331168 1.03683 0.000112
C  3.146898 -0.144734 0.000054
C  -0.003981 2.033767 0.000224
C  -1.386789 1.884732 0.000277
C  0.600936 -2.885297 0.000053
C  -0.772459 -3.049199 0.000076
C  -3.419398 0.322589 0.000202
C  -3.072949 -2.096781 0.000125
C  3.014949 2.293087 0.000114
C  -3.934947 -0.994641 0.000135
C  4.56603 -0.079254 -0.000004
C  4.412127 2.362144 0.000058
C  5.194707 1.16962 0.0000
H  0.402339 3.049067 0.000248
H  -2.0321 2.76111 0.000375
H  1.295097 -3.728316 0.000013
H  -1.207559 -4.054296 0.000052
H  -3.483169 -3.111823 0.000115
H  2.437804 3.221728 0.000154
H  -5.019944 -1.120451 0.000092
H  5.123532 -1.018326 -0.000045
H  4.90828 3.338266 0.000057
H  6.287583 1.232294 -0.000042
