program: Gaussian 09
title: 000126520
version: EM64L-G09RevD.01
frameworkgroup: C1[X(C17H27N7O6)]
method: RPBEPBE
basis: SDD
operation: Freq
keyword: #p
keyword: freq=noraman
keyword: PBEPBE/SDD
title: #p freq=noraman PBEPBE/SDD
converged: YES YES NO NO
title: Mulliken charges:
elementType: O O O O O O N N N N N N N C C C C C C C C C C C C C C C C C H H H H H H H H H H H H H H H H H H H H H H H H H H H
charge: -0.313110 -0.322329 -0.368755 -0.278141 -0.422390 -0.242365 -0.438763 -0.393444 -0.106767 -0.058301 -0.608833 -0.628374 -0.654620 -0.101846 -0.454837 -0.198023 -0.528763 -0.013976 0.336997 0.250590 0.329993 0.163465 -0.710938 -0.713186 -0.699934 0.205122 0.006470 0.122296 -0.828052 0.109763 0.248636 0.326454 0.220853 0.278684 0.275041 0.242117 0.203504 0.379653 0.268981 0.209706 0.220244 0.221470 0.211580 0.262869 0.203753 0.228953 0.229550 0.316641 0.382038 0.226508 0.300658 0.235877 0.434985 0.308815 0.325667 0.406830 0.390985
chargesum: 0.00000
title: Mulliken charges with hydrogens summed into heavy atoms:
elementType: O O O O O O N N N N N N N C C C C C C C C C C C C C C C C C
charge: -0.313110 -0.322329 -0.368755 -0.278141 -0.031405 -0.242365 -0.163722 -0.013791 -0.106767 -0.058301 0.089845 0.115426 0.077877 0.146789 0.092470 0.080661 -0.083141 -0.013976 0.336997 0.250590 0.329993 0.163465 -0.012007 -0.017267 -0.037677 0.205122 0.006470 0.122296 -0.065009 0.109763
polarizability: 2.79880072e+02 1.40906187e+01 2.75961426e+02 -2.23279405e+01 6.35373224e+00 2.31866773e+02
1716.lowfreq: -5.1204 -4.9678 -4.0809 -0.0003 0.0004 0.0006 3.3063 18.9929 26.0574
frequency: -1.2387 18.9684 25.9504 29.4615 42.0102 48.3091 57.0197 65.6758 71.8747 79.7950 95.2360 103.3636 116.8954 121.6593 123.8196 135.3342 142.9025 166.2764 173.5757 174.9978 185.9619 199.5746 231.3626 236.9158 248.5983 252.0890 265.3019 279.3634 286.3872 309.0599 322.5237 327.5322 329.4148 333.3624 345.3995 364.9065 395.8701 400.9480 410.0545 430.4465 432.9133 436.2836 466.7859 470.6792 485.1742 525.2282 541.5038 561.1058 573.5678 578.0243 580.3232 623.2686 626.1622 633.0847 639.0824 659.1550 697.8752 705.4993 707.5516 716.9386 727.0588 736.8423 754.8290 773.1120 793.2014 804.9607 820.9597 823.5162 839.8229 852.1680 854.6647 862.2213 867.8844 912.1819 921.0997 924.0448 940.2627 955.4633 965.4815 992.5362 1001.6024 1012.5681 1029.6072 1033.9509 1039.3976 1050.2888 1064.5558 1095.9295 1108.5239 1113.4661 1117.0474 1130.9819 1136.0202 1169.7577 1180.3296 1188.9518 1219.8236 1248.6888 1251.3093 1256.6344 1270.1299 1279.3424 1285.9920 1303.8758 1313.3929 1321.9034 1324.9025 1348.8587 1354.6408 1371.9030 1372.8889 1377.3693 1381.3438 1396.2745 1399.5495 1407.1212 1443.6941 1444.0347 1446.0535 1450.3908 1462.8606 1466.4873 1467.2774 1467.4320 1469.3594 1479.8923 1480.6553 1483.9250 1503.0050 1520.4478 1556.2931 1572.6632 1585.6635 1623.5088 1633.2282 1636.5949 1640.2169 1640.9892 2910.6862 2961.4079 2966.2456 2987.3533 2988.9026 2991.2212 2995.9327 3016.8540 3028.2198 3081.3841 3085.1090 3085.3177 3094.6510 3097.3222 3100.1004 3112.6898 3117.1673 3136.7988 3249.9729 3272.1082 3316.5714 3348.0519 3435.7701 3511.7627 3593.7965 3613.1458 3653.3386
redmass: 6.5213 5.0057 5.1304 3.6857 9.8752 4.5196 3.3920 4.2811 5.2101 2.9081 2.5828 3.2805 6.1827 3.9553 5.9268 5.2813 5.6459 3.7730 1.3998 3.3319 4.4501 4.3349 4.3508 1.2140 2.1966 1.1290 3.1319 4.2010 5.0810 4.2257 4.5125 3.4291 2.8027 3.2025 4.1422 4.7868 5.4935 3.3578 2.8374 2.6247 2.8439 3.4743 2.7829 2.6833 1.3160 3.7168 3.1987 3.0392 3.2971 2.7590 4.1330 1.4344 2.5592 1.9156 1.7711 2.1738 4.1291 8.1971 4.6380 3.8696 4.4758 4.7835 4.4060 4.2273 3.6030 3.0440 2.1663 1.4861 1.2417 1.8589 1.7885 1.2856 3.2807 1.5877 1.6271 2.5683 3.2644 1.2026 2.3738 5.8423 2.9496 3.5447 1.4266 1.4381 1.5079 2.5138 2.0244 2.1024 3.5444 1.9278 2.3180 2.0485 4.0167 2.0970 2.1044 1.9788 1.4511 1.3183 2.7633 3.0022 2.6981 1.2985 1.3374 3.4158 1.4975 1.4440 1.5279 3.5859 2.0361 1.2316 3.2509 1.2356 1.5921 1.2949 1.2189 3.1081 1.1485 1.0611 2.0522 1.5804 1.8725 1.0692 1.0855 1.2230 1.0718 1.0645 1.2837 1.0796 1.0619 6.4966 3.3181 3.2421 1.3659 2.7631 2.0833 2.7188 3.1604 2.9013 1.0816 1.0418 1.0728 1.0796 1.0361 1.0356 1.0362 1.0591 1.0967 1.0993 1.0991 1.1034 1.0944 1.0993 1.1004 1.1004 1.0997 1.0937 1.0667 1.0772 1.0639 1.0591 1.0743 1.0639 1.0883 1.0923 1.0889
irintensity: 0.7105 0.2321 1.5828 0.4046 2.0782 1.7915 1.8553 0.8005 1.0875 10.1228 4.3989 3.0688 6.3428 0.7383 2.5896 3.6389 3.7284 4.8590 0.9809 1.3482 7.7220 5.5681 8.1560 2.5721 10.3816 1.7762 14.5695 11.4749 1.6908 10.7523 14.1980 9.5776 4.9472 0.2804 2.4570 2.4648 4.0568 14.3819 3.2171 7.9782 2.0657 16.7631 27.3173 9.2136 80.1343 6.4426 9.0385 15.4190 9.4136 1.0481 14.7374 244.5461 7.7619 60.5411 42.2492 102.7397 25.9506 24.2092 14.5425 24.4686 12.7026 57.1848 33.4788 24.3839 26.9407 18.1126 47.4640 76.0221 146.5831 132.6099 180.8604 62.7618 8.4111 1.2094 2.7456 13.7000 28.4289 0.2306 38.0475 131.1597 297.2293 6.2839 0.1445 6.0904 4.4957 21.4858 6.4914 48.0900 63.0870 80.0254 64.1771 11.3662 86.3432 262.0718 3.1787 29.9869 78.0742 21.2804 2.1277 26.7877 28.6538 7.7413 53.4160 33.4597 33.6000 27.2946 35.1618 2.9468 35.0720 41.2185 121.6589 41.0874 7.0083 56.5768 36.8546 55.0569 16.3449 22.1573 576.3738 8.6903 110.8692 10.4345 19.4418 5.4634 31.3282 4.8280 11.8085 21.8922 55.0460 134.6001 62.1575 398.7358 49.9090 358.4068 262.5234 271.2212 140.2051 259.4229 34.2704 22.4165 29.6405 70.6611 26.2493 11.2852 29.2671 19.7955 17.3861 9.7686 21.1910 15.7092 13.1865 59.7947 27.8235 5.7300 16.0535 2.2945 206.0955 633.8713 668.6581 393.1320 0.2153 47.6788 49.7973 72.6922 72.1313
temp: 298.150 k
press: 1.00000 atm
elementType: 8 8 8 8 8 8 7 7 7 7 7 7 7 6 6 6 6 6 6 6 6 6 6 6 6 6 6 6 6 6 1 1 1 1 1 1 1 1 1 1 1 1 1 1 1 1 1 1 1 1 1 1 1 1 1 1 1
symmnumber: 1
zpe: 1195764.4 jmol-1
zpe.correction: 0.455443 hartree
zpe.thermalcorrener: 0.486463 hartree
zpe.thermalcorrenthalpy: 0.487408 hartree
zpe.thermalcorrgfe: 0.392532 hartree
zpe.sumelectzpe: -1496.407601 hartree
zpe.sumelectthermal: -1496.376580 hartree
zpe.sumelectthermalent: -1496.375636 hartree
zpe.sumelectthermalfe: -1496.470511 hartree
dipole: 2.3138 4.3154 3.7302
dipole: 6.1556
quadrupole: -163.5714 -177.5961 -184.3360
quadrupole: -13.2985 -6.3638 -11.8846
quadrupole: 11.5964 -2.4283 -9.1681 -13.2985 -6.3638 -11.8846
hfenergy: -1496.8630438 hartree
pointgroup: C01 [X(C17H27N7O6)]
dipole: -0.9884597 1.3758351 1.7306258 debye
polarizability: 268.0805774|28.664459|241.1441829|-15.6996302|2.9690596|278.4835114 unknown
InChI: InChI=1S/C17H27N7O6/c1-7-11(15(27)28)23-14(24-12(7)19)8(5-10(18)25)21-6-9(13(20)26)22-16(29)30-17(2,3)4/h8-9,21-22,27H,5-6,18-20H2,1-4H3
charge 0 multiplicity 1
57 atoms
O  -3.638875 0.449195 -0.687593
O  -0.328809 -2.269435 2.74979
O  -4.307488 -1.338952 0.721308
O  3.287994 -1.782902 -4.350419
O  4.346109 2.753549 -1.41382
O  4.027995 3.921157 0.556351
N  0.097393 -1.650012 -1.237506
N  -2.090614 -1.036601 0.037639
N  2.663276 0.841292 -0.731982
N  1.76011 -0.696139 0.875055
N  -2.649623 -2.220513 2.767657
N  3.93956 0.154982 -3.227189
N  1.718826 -0.289085 3.14746
C  1.532448 -1.271186 -1.48647
C  -0.199554 -2.616264 -0.139338
C  -1.572584 -2.308155 0.562438
C  1.63736 -0.672759 -2.914729
C  2.016881 -0.305797 -0.394972
C  -5.031243 1.067717 -0.773157
C  -1.439095 -2.260751 2.126869
C  -3.413485 -0.693333 0.07485
C  3.030878 -0.821728 -3.558002
C  -5.994389 0.064031 -1.437468
C  -5.494585 1.492241 0.634858
C  -4.773762 2.287733 -1.674304
C  2.818996 1.372042 1.671539
C  3.077096 1.652525 0.309261
C  2.100634 0.133477 1.904649
C  3.226716 2.211615 2.860559
C  3.833669 2.88017 -0.116741
H  2.183375 -2.175181 -1.433953
H  0.585996 -2.514782 0.622992
H  -0.217034 -3.66168 -0.507075
H  -2.310352 -3.10597 0.342802
H  -0.316353 -1.961406 -2.127055
H  1.321051 0.384018 -2.893725
H  0.95793 -1.234402 -3.58085
H  -1.402332 -0.560835 -0.57921
H  -6.130837 -0.826359 -0.804013
H  -6.977397 0.545336 -1.59278
H  -5.605624 -0.24918 -2.422682
H  -4.739157 2.143956 1.108959
H  -6.437943 2.062477 0.553156
H  -5.666095 0.61294 1.275207
H  -5.716408 2.840206 -1.836784
H  -4.041431 2.968446 -1.20723
H  -4.378068 1.969745 -2.65409
H  -2.662911 -2.161691 3.786575
H  -3.513392 -2.085281 2.208908
H  3.806158 1.602706 3.582942
H  3.826761 3.082213 2.567261
H  2.331219 2.592773 3.392288
H  3.715211 0.828747 -2.478152
H  4.879055 0.095649 -3.619287
H  1.905416 0.260343 3.981565
H  1.099117 -1.117564 3.181354
H  4.817011 3.598965 -1.649613
