program: Gaussian 09
title: 000126470
version: EM64L-G09RevD.01
frameworkgroup: C1[X(C22H22N6O5)]
method: RPBEPBE
basis: SDD
operation: Freq
keyword: #p
keyword: freq=noraman
keyword: PBEPBE/SDD
title: #p freq=noraman PBEPBE/SDD
converged: YES YES NO NO
title: Mulliken charges:
elementType: O O O O O N N N N N N C C C C C C C C C C C C C C C C C C C C C C H H H H H H H H H H H H H H H H H H H H H H
charge: -0.295580 -0.440846 -0.451762 -0.470028 -0.228549 -0.294882 -0.069459 -0.447127 -0.475474 -0.044468 -0.639196 -0.102802 -0.148570 -0.237094 -0.051908 -0.355044 0.333546 0.186485 -0.129946 -0.016633 0.123693 0.448045 -0.493639 -0.349976 0.371598 -0.383088 -0.410442 0.335399 -0.398067 -0.393703 -0.237308 -0.237966 -0.245597 0.294581 0.282733 0.249418 0.256389 0.237009 0.242371 0.372433 0.376147 0.392353 0.328488 0.365833 0.219521 0.331580 0.340834 0.341628 0.235261 0.239212 0.231330 0.239834 0.221642 0.224519 0.227270
chargesum: 0.00000
title: Mulliken charges with hydrogens summed into heavy atoms:
elementType: O O O O O N N N N N N C C C C C C C C C C C C C C C C C C C C C C
charge: -0.295580 -0.068413 -0.075615 -0.104195 -0.228549 -0.294882 -0.069459 -0.054774 -0.146985 -0.044468 0.043266 0.191779 0.134163 0.012324 0.204481 0.124337 0.333546 0.186485 -0.129946 -0.016633 0.123693 0.448045 -0.274118 -0.018396 0.371598 -0.147827 -0.171230 0.335399 -0.166737 -0.153869 -0.015666 -0.013447 -0.018327
polarizability: 5.45839197e+02 -1.72644066e+01 3.13874153e+02 1.58521626e+01 1.64536278e+01 1.56007312e+02
1716.lowfreq: -7.6676 -0.0010 0.0006 0.0007 2.7250 3.7782 10.1079 26.1125 35.1529
frequency: 8.4746 25.9618 34.9722 36.9195 44.1813 56.0493 67.4344 74.7752 78.1214 98.0703 111.0752 123.5312 141.6993 165.5732 174.3547 180.3890 192.6459 206.8817 212.3453 240.7510 245.6903 272.7518 277.9216 287.8949 305.2567 316.8713 323.0732 335.6178 344.8747 357.3260 360.6136 383.5716 405.6022 410.7658 415.8756 435.5394 459.5863 466.1850 496.2089 504.1263 510.0117 518.5189 535.5366 544.5927 554.1279 559.3248 588.3909 613.8747 628.4772 630.5943 644.1564 650.4848 672.5182 674.9872 691.9515 700.5098 723.5542 728.3514 744.3002 757.4918 761.0262 769.4398 799.3188 805.7766 818.8203 831.9888 846.0587 849.1357 866.4035 873.4319 892.8835 915.2590 937.9684 941.0186 953.4524 971.0467 986.5991 987.8734 990.5351 991.6169 996.2094 999.4047 1001.8162 1014.7500 1019.5364 1024.7009 1040.7536 1047.8824 1057.0909 1069.0005 1084.3267 1093.0366 1130.0779 1157.6802 1165.1093 1172.1646 1176.4844 1190.6800 1202.3991 1216.1743 1227.6743 1240.6211 1256.9979 1261.4670 1272.2202 1277.1578 1291.8911 1294.4073 1304.3542 1304.6342 1321.3871 1322.9442 1329.5838 1337.3645 1338.7734 1359.8290 1364.1310 1375.4069 1392.9726 1396.7772 1398.3978 1425.8887 1437.7992 1467.8973 1477.0418 1499.4503 1515.1797 1528.9439 1533.1982 1571.8149 1582.2792 1594.1769 1597.6080 1611.6729 1620.5606 1626.1365 1638.8396 2994.8997 3011.6956 3014.4215 3019.6030 3031.2124 3086.8987 3102.7038 3120.0121 3125.6210 3137.8224 3139.2864 3144.5177 3147.6866 3163.5640 3169.3056 3413.5229 3447.8068 3526.7160 3539.7742 3578.9849 3587.6786 3694.5820
redmass: 5.6663 4.2296 6.0526 7.0640 5.3656 6.0881 7.4356 4.2256 4.1199 6.2874 6.1952 6.3893 6.9688 5.4360 4.8100 5.5783 6.2026 5.3940 6.4860 4.0714 3.2695 4.7682 2.6607 7.8495 2.7944 3.3326 4.3086 3.2603 6.1465 5.6048 4.2829 1.5680 2.8452 3.4106 3.0531 3.7945 1.1867 1.5302 6.3485 3.1314 1.1169 3.0489 4.2804 1.4578 2.5097 3.9223 7.0838 6.5335 9.3587 7.1327 6.6501 7.9671 6.9700 5.2530 10.5102 1.7173 6.0337 3.2788 6.2501 5.5022 9.1077 1.9646 1.2694 2.4519 1.4793 5.5354 2.4096 2.0139 1.4078 3.7103 6.9439 1.4595 3.1551 1.4055 4.1663 1.4220 5.0942 3.8340 1.3152 5.6341 2.6796 1.3762 3.4043 2.8574 3.1967 2.9251 1.9063 2.6988 5.9846 5.7540 1.6197 2.7707 1.3917 2.8105 1.2183 1.0523 1.2315 1.1137 1.1978 3.4589 1.2737 4.2668 1.3207 2.1358 1.4940 1.3871 3.3227 1.2714 1.3105 1.4805 1.3922 1.4149 3.7909 1.2919 1.3913 1.5851 2.8768 8.7096 1.2396 1.5433 3.8209 3.9222 2.4274 1.0851 2.1796 2.3502 3.0451 3.3346 5.0769 5.6189 5.7136 4.3590 1.4687 6.0116 8.5344 6.5567 4.3818 1.0648 1.0857 1.0858 1.0871 1.0878 1.1012 1.0887 1.0844 1.0871 1.0912 1.0917 1.0933 1.0959 1.1016 1.0962 1.0812 1.0647 1.0466 1.0760 1.0663 1.0670 1.1042
irintensity: 2.0107 1.1650 4.6579 1.7963 6.6929 0.7354 5.1980 0.9916 0.9326 0.5532 2.9834 0.7395 1.6498 1.7631 16.0221 1.6263 0.4311 1.2800 0.8327 13.1727 22.2023 15.3957 9.9764 11.2231 1.6116 2.6049 0.3515 21.7939 7.3142 2.3685 20.5459 154.2764 0.1509 12.5110 1.4838 38.1037 123.0101 115.0083 6.6969 12.2789 125.1874 13.4699 14.6682 130.7661 1.8196 26.4262 7.8069 0.5899 4.9367 4.7375 4.2095 5.4535 9.7044 15.4896 11.1828 48.3006 18.2603 12.4550 17.9791 5.0050 25.2874 89.5561 163.2374 7.9008 27.2047 16.0895 1.6987 0.4723 34.4716 20.0486 39.4819 1.5273 61.5166 5.9693 100.9750 0.1144 15.8118 47.1877 0.2932 1.4887 96.4031 5.3428 67.0903 8.6486 15.0418 58.8474 8.0776 14.5064 79.1937 6.5409 8.4071 4.0631 8.9352 21.4047 38.9549 0.0375 42.2549 5.3751 18.3351 27.3061 14.2863 87.6542 33.2538 53.8775 11.3185 7.6504 30.9098 1.0527 21.4093 3.4043 26.7816 5.8620 67.6002 21.3403 53.1375 31.2112 40.2596 3.5320 11.1933 21.6701 299.7935 13.5758 23.1904 15.4991 129.9087 100.0843 25.0068 273.1911 188.1727 649.3478 338.0416 195.0976 101.2665 50.0930 299.4082 315.5547 292.0749 33.7624 18.2119 18.9847 8.8375 36.2396 23.4182 29.6658 8.7774 1.5025 21.1958 7.3764 3.6345 50.5229 31.7288 21.2403 341.9521 64.0971 144.7779 20.7276 19.2131 30.1718 78.9529
temp: 298.150 k
press: 1.00000 atm
elementType: 8 8 8 8 8 7 7 7 7 7 7 6 6 6 6 6 6 6 6 6 6 6 6 6 6 6 6 6 6 6 6 6 6 1 1 1 1 1 1 1 1 1 1 1 1 1 1 1 1 1 1 1 1 1 1
symmnumber: 1
zpe: 1110110.8 jmol-1
zpe.correction: 0.422819 hartree
zpe.thermalcorrener: 0.451864 hartree
zpe.thermalcorrenthalpy: 0.452808 hartree
zpe.thermalcorrgfe: 0.361250 hartree
zpe.sumelectzpe: -1553.786573 hartree
zpe.sumelectthermal: -1553.757528 hartree
zpe.sumelectthermalent: -1553.756584 hartree
zpe.sumelectthermalfe: -1553.848142 hartree
dipole: -7.7503 -13.5746 1.5532
dipole: 15.7083
quadrupole: -137.3643 -218.6525 -188.7520
quadrupole: 24.6222 -3.6659 -14.8286
quadrupole: 44.2253 -37.0629 -7.1624 24.6222 -3.6659 -14.8286
hfenergy: -1554.2093923 hartree
pointgroup: C01 [X(C22H22N6O5)]
dipole: 3.059212 5.3378048 0.5854503 debye
polarizability: 545.6170211|-17.6798466|313.859856|-17.8883997|-16.6227692|156.2437853 unknown
InChI: InChI=1S/C22H22N6O5/c23-21-26-18-15(19(32)27-21)25-22(28(18)20-17(31)16(30)14(10-29)33-20)24-13-8-6-12(7-9-13)11-4-2-1-3-5-11/h1-9,14,16-17,20,24,26,29-31H,10,23H2
charge 0 multiplicity 1
55 atoms
O  3.954259 1.459991 -1.054564
O  1.89486 3.770651 -0.622946
O  3.536271 3.965157 1.488525
O  6.427907 0.59165 -0.153024
O  1.63754 -4.417615 0.558941
N  2.020939 0.09103 -0.668818
N  0.549017 -1.613383 -0.196654
N  4.147404 -1.235888 -0.395725
N  -0.36761 0.583495 -0.810782
N  3.80617 -3.524646 0.330047
N  5.973472 -2.637845 0.066319
C  2.490712 1.453654 -0.994995
C  2.092395 2.506852 0.070673
C  3.341743 2.591885 1.005647
C  4.530353 2.216775 0.090295
C  5.591959 1.346667 0.79577
C  2.775558 -1.059546 -0.390085
C  0.653973 -0.329371 -0.558052
C  1.875375 -2.08533 -0.079775
C  2.371804 -3.427666 0.285518
C  4.596439 -2.509215 0.010209
C  -1.758482 0.401436 -0.583414
C  -2.624509 1.481202 -0.909417
C  -2.308627 -0.792454 -0.045171
C  -4.582891 0.191741 -0.145812
C  -4.008895 1.372732 -0.694589
C  -3.697873 -0.875925 0.168229
C  -6.05036 0.081471 0.086712
C  -6.830738 1.226314 0.414067
C  -6.717363 -1.172556 -0.008579
C  -8.220619 1.12333 0.634709
C  -8.106206 -1.278285 0.216616
C  -8.867762 -0.130654 0.538612
H  2.116442 1.763964 -1.988591
H  1.180428 2.219966 0.626954
H  3.236532 1.879086 1.845932
H  4.979675 3.140427 -0.322151
H  5.115059 0.562761 1.406453
H  6.211474 1.989036 1.452781
H  2.319772 4.482488 -0.067103
H  3.130998 4.080047 2.384006
H  4.797804 -0.508685 -0.721611
H  -0.118441 1.445429 -1.29887
H  6.887523 1.206867 -0.777561
H  -2.21306 2.404157 -1.340039
H  -1.645966 -1.628718 0.190236
H  6.33549 -3.548113 0.336703
H  6.589255 -1.830912 -0.029063
H  -4.65706 2.20676 -0.985627
H  -4.09693 -1.793644 0.614404
H  -6.339961 2.199875 0.527736
H  -6.149596 -2.066468 -0.290191
H  -8.797107 2.01913 0.893015
H  -8.596105 -2.254868 0.130422
H  -9.94654 -0.212341 0.711977
