program: Gaussian 09
title: 000126346
version: EM64L-G09RevD.01
frameworkgroup: C1[X(C22H14INO6)]
method: RPBEPBE
basis: SDD
operation: Freq
keyword: #p
keyword: freq=noraman
keyword: PBEPBE/SDD
title: #p freq=noraman PBEPBE/SDD
converged: YES YES NO NO
title: Mulliken charges:
elementType: I O O O O O O N C C C C C C C C C C C C C C C C C C C C C C H H H H H H H H H H H H H H
charge: 0.050005 -0.221522 -0.271511 -0.216132 -0.424339 -0.424463 -0.231928 -0.435032 -0.088570 0.367108 0.362981 0.358878 0.078750 0.156117 0.154628 0.100555 -0.541332 -0.331591 -0.326002 -0.369421 0.528450 -0.546220 -0.511166 -0.473612 -0.393597 -0.430314 0.314926 0.323370 0.268383 -0.841946 0.325154 0.247032 0.245562 0.272339 0.257678 0.285338 0.237051 0.256530 0.225687 0.300345 0.360501 0.359738 0.320250 0.321339
chargesum: 0.00000
title: Mulliken charges with hydrogens summed into heavy atoms:
elementType: I O O O O O O N C C C C C C C C C C C C C C C C C C C C C C
charge: 0.050005 -0.221522 -0.271511 -0.216132 -0.063838 -0.064725 -0.231928 -0.134688 -0.088570 0.367108 0.362981 0.358878 0.078750 0.156117 0.154628 0.100555 -0.216178 -0.084559 -0.080441 -0.097081 0.528450 -0.288542 -0.225828 -0.236560 -0.137066 -0.204627 0.314926 0.323370 0.268383 -0.200357
polarizability: 3.51480359e+02 1.71791865e-01 2.91964575e+02 -4.32026881e+01 -1.74928511e+00 2.79063098e+02
1716.lowfreq: -8.9171 -0.9190 0.0003 0.0004 0.0005 2.9618 9.4159 19.4741 26.5063
frequency: 6.7423 19.3654 26.4871 45.4383 47.3425 63.1478 64.4428 66.1713 89.3717 102.0445 134.4635 142.7206 186.9511 188.7480 215.2998 232.6863 245.3000 271.0559 279.7140 296.5736 300.4686 310.3317 320.6229 341.0196 358.9707 367.4300 374.0511 375.8402 410.8952 421.9540 442.2862 461.0179 463.5742 473.1852 521.5513 549.2080 553.7144 566.9832 589.7868 591.4404 600.1308 611.0144 620.3733 630.4219 641.6018 655.9599 666.8667 700.8372 708.1428 718.8302 725.2202 736.2467 744.2925 765.7292 768.8619 775.5143 802.5877 826.2529 836.6637 837.4092 852.5366 863.7767 870.6263 906.1874 923.6802 937.3294 940.4213 948.2418 958.1469 965.1625 975.8891 976.9770 1023.4577 1079.1875 1102.0722 1112.3910 1131.4212 1141.3694 1142.2243 1152.4323 1165.0297 1191.9209 1193.1441 1208.6310 1215.5889 1219.2042 1239.6266 1256.5603 1269.2310 1277.6234 1284.1814 1291.2742 1310.3399 1393.2691 1397.6218 1408.4337 1409.9198 1431.4119 1436.0910 1453.3297 1484.0947 1496.1279 1500.9349 1528.9932 1582.8830 1597.4113 1603.0417 1610.6218 1623.9099 1629.5552 1647.0457 1679.4604 3065.2467 3126.7609 3126.9768 3144.5208 3145.8406 3148.3651 3154.4301 3165.5709 3182.5882 3185.3198 3189.8626 3438.9045 3583.7166 3586.1282
redmass: 7.6736 6.8251 6.5984 6.7208 5.0958 8.4125 10.3629 4.5992 9.9396 4.8957 5.3905 7.6484 5.4597 7.7406 9.2233 5.4876 8.8979 6.7037 10.5493 8.8401 5.1504 6.0424 8.0182 7.4942 1.1282 1.3015 3.5249 5.4785 4.7864 6.4068 3.1425 3.1992 4.3960 3.3128 4.7987 7.2453 3.4419 8.3459 7.1907 8.4573 7.2186 4.1850 5.1032 5.6214 4.4331 5.6857 3.7368 8.1653 5.4684 3.1675 1.2415 7.6037 7.9182 3.4112 4.8076 4.0800 1.7106 1.8038 1.7220 1.6848 1.5230 1.5932 6.2988 3.7348 4.6234 5.8581 1.4102 1.7310 1.4082 4.1777 2.7732 1.4314 5.9484 2.9904 1.9294 1.9454 1.5862 1.4562 1.1530 1.4565 1.3216 1.7908 2.0219 1.5662 1.9913 1.7813 2.4117 2.4739 1.7785 3.6553 3.0619 2.0346 2.1029 5.2409 7.1297 5.5537 1.2506 4.1002 4.5382 4.2050 3.2166 3.1522 3.1662 2.1137 7.2511 6.7623 7.3555 5.6996 7.3515 7.0462 7.2716 12.8989 1.0566 1.0900 1.0884 1.0897 1.1077 1.0922 1.0958 1.0959 1.0957 1.0937 1.0930 1.0769 1.0661 1.0661
irintensity: 0.3369 0.0302 0.0209 1.5980 4.2237 9.0668 1.8793 0.5348 1.0525 1.6315 0.7651 1.6213 1.9701 4.5900 4.9716 0.1441 1.6767 0.0716 2.2068 3.0802 0.4861 4.3928 1.8547 18.9217 123.0611 130.7808 31.2596 2.1069 20.7251 24.7059 2.7092 16.8067 15.1310 0.7842 9.0750 10.4871 3.6242 6.7950 12.7620 5.0841 1.6056 2.8695 136.9277 1.2365 4.8857 21.9346 26.7236 17.6091 39.1917 6.1432 22.2214 1.6021 1.7004 4.9571 3.5052 118.7097 20.6374 13.9305 13.1765 59.4614 65.1911 38.5834 4.6057 1.7549 19.9247 2.7431 2.9176 15.0615 0.8606 48.5899 93.5091 9.7936 174.3455 54.4830 281.5172 15.2848 442.9744 89.9884 2.3456 39.8457 27.8390 59.0186 7.4204 97.5712 9.4590 14.0875 18.5091 58.8560 73.3424 22.4723 19.3790 37.3990 69.4969 122.6703 83.9562 32.4241 16.9164 140.5117 56.0118 82.9218 84.1767 92.6460 41.6483 695.9118 23.5632 172.3144 153.4559 42.5439 81.8014 298.7983 77.7059 385.8683 0.5698 13.2242 10.9521 6.6267 0.3725 2.6136 8.3601 4.3754 3.5119 4.9140 0.1580 164.9464 63.7314 61.1667
temp: 298.150 k
press: 1.00000 atm
elementType: 53 8 8 8 8 8 8 7 6 6 6 6 6 6 6 6 6 6 6 6 6 6 6 6 6 6 6 6 6 6 1 1 1 1 1 1 1 1 1 1 1 1 1 1
symmnumber: 1
zpe: 814511.1 jmol-1
zpe.correction: 0.310231 hartree
zpe.thermalcorrener: 0.335625 hartree
zpe.thermalcorrenthalpy: 0.336569 hartree
zpe.thermalcorrgfe: 0.250774 hartree
zpe.sumelectzpe: -1362.304140 hartree
zpe.sumelectthermal: -1362.278746 hartree
zpe.sumelectthermalent: -1362.277802 hartree
zpe.sumelectthermalfe: -1362.363597 hartree
dipole: -4.9112 -1.7005 -2.9728
dipole: 5.9874
quadrupole: -184.6384 -165.9554 -202.4381
quadrupole: 3.3725 -26.9887 -6.2676
quadrupole: -0.2944 18.3886 -18.0941 3.3725 -26.9887 -6.2676
hfenergy: -1362.6143711 hartree
pointgroup: C01 [X(C22H14I1N1O6)]
dipole: -1.7886941 -0.8116908 -1.3002617 debye
polarizability: 351.3533244|13.9885129|295.0756358|-39.944504|-6.1711|276.0790722 unknown
InChI: InChI=1S/C22H14INO6/c23-10-20(27)24-11-1-4-14-17(7-11)22(30-21(14)28)15-5-2-12(25)8-18(15)29-19-9-13(26)3-6-16(19)22/h1-9,24-26H,10H2
charge 0 multiplicity 1
44 atoms
I  -7.334152 -1.10931 -0.684995
O  1.622396 -0.056848 2.114837
O  2.943697 0.626859 -1.405009
O  0.936461 -0.467767 4.3137
O  2.031398 5.371721 -1.094249
O  3.749384 -3.965173 -2.378661
O  -3.263677 -0.329024 -2.233385
N  -4.065986 -0.726895 -0.055356
C  0.945891 0.01194 0.693931
C  -0.514095 -0.283275 1.039754
C  1.19188 1.406543 0.163222
C  1.615473 -1.047726 -0.153539
C  -0.661099 -0.489306 2.424255
C  2.192446 1.654216 -0.80601
C  2.603449 -0.706484 -1.111961
C  0.654532 -0.354497 3.104889
C  -1.607442 -0.351924 0.162303
C  0.493274 2.531174 0.677907
C  1.348476 -2.425958 0.039581
C  -1.920557 -0.774098 2.990333
C  -2.881713 -0.637091 0.726887
C  2.502703 2.955182 -1.253228
C  3.307324 -1.677309 -1.847971
C  -3.030922 -0.846506 2.132204
C  0.775972 3.836858 0.255172
C  2.0316 -3.420359 -0.678726
C  1.791331 4.045121 -0.713677
C  3.020484 -3.035968 -1.624128
C  -4.205221 -0.574044 -1.419645
C  -5.604513 -0.708964 -2.032378
H  -1.502503 -0.193237 -0.91258
H  -0.281416 2.371731 1.435192
H  0.595781 -2.721492 0.777863
H  -2.018862 -0.93098 4.068818
H  3.285345 3.081459 -2.009112
H  4.060797 -1.379847 -2.580103
H  -4.0254 -1.064844 2.540518
H  0.241527 4.701033 0.657377
H  1.808606 -4.479931 -0.504782
H  -4.933731 -0.92533 0.457539
H  2.759606 5.428263 -1.761592
H  3.488419 -4.891566 -2.150258
H  -5.604049 -1.54148 -2.752198
H  -5.859113 0.226329 -2.553238
