program: Gaussian 09
title: 000126251
version: EM64L-G09RevD.01
frameworkgroup: C1[X(C6H14O4S3)]
method: RPBEPBE
basis: SDD
operation: Freq
keyword: #p
keyword: freq=noraman
keyword: PBEPBE/SDD
title: #p freq=noraman PBEPBE/SDD
converged: YES YES NO NO
title: Mulliken charges:
elementType: S S S O O O O C C C C C C H H H H H H H H H H H H H H
charge: 0.946024 0.639085 0.639301 -0.582077 -0.581922 -0.624384 -0.624476 -0.573149 -0.573140 -0.627697 -0.628018 -0.830859 -0.830798 0.305425 0.354016 0.305405 0.353914 0.320332 0.286344 0.320556 0.286311 0.339529 0.274583 0.245824 0.339435 0.274584 0.245852
chargesum: 0.00000
title: Mulliken charges with hydrogens summed into heavy atoms:
elementType: S S S O O O O C C C C C C
charge: 0.946024 0.639085 0.639301 -0.582077 -0.581922 -0.624384 -0.624476 0.086293 0.086179 -0.021021 -0.021151 0.029077 0.029073
polarizability: 1.85562191e+02 9.36066688e-03 1.29678719e+02 1.40690962e+01 1.14285264e-02 1.31010178e+02
1716.lowfreq: -37.8971 -28.1665 -18.3850 -8.9236 -6.2936 -0.0033 -0.0027 0.0023 34.4259
frequency: -35.9020 -28.1616 34.4090 56.6514 97.3683 122.2395 141.5998 177.3104 181.0112 184.1007 191.3582 223.6775 227.9371 258.6742 270.9264 273.9267 275.4572 292.0479 292.6968 331.4920 410.4786 426.7980 432.1870 449.7097 463.4923 518.8190 562.9496 570.6140 579.7949 767.8205 773.2467 779.0063 811.0049 837.6021 854.0067 890.4063 928.4500 975.1477 975.2951 999.7754 1000.4553 1047.1687 1047.7601 1120.1417 1120.7186 1161.7842 1163.0428 1198.2702 1203.0212 1301.3301 1329.0864 1330.3961 1341.2626 1371.7916 1379.1903 1404.7863 1407.4253 1426.7344 1427.0321 1450.3738 1450.8907 2760.0359 2764.7578 2991.6273 2992.4714 3036.5175 3037.3977 3124.0017 3124.7564 3130.5751 3130.9582 3139.7025 3140.2216 3156.1018 3156.1874
redmass: 4.3274 9.2432 5.0581 5.6633 4.2368 3.8893 3.4628 2.3905 2.2055 2.1296 1.9986 3.3644 2.4325 3.5449 4.9821 3.5138 3.2299 3.1256 2.8305 9.8372 6.9303 6.2738 3.8129 3.8065 4.1545 3.9121 7.4287 6.7166 8.3664 6.8941 12.9274 9.8044 1.6239 1.8598 2.6248 1.5442 2.5154 1.2641 1.2631 1.2737 1.2703 1.7178 2.1202 1.6570 1.4198 1.0966 1.0877 1.2246 1.2177 1.1429 1.1326 1.1321 1.1090 1.0880 1.0764 1.1083 1.1059 1.0490 1.0493 1.0565 1.0567 1.0726 1.0716 1.0281 1.0280 1.0585 1.0584 1.0934 1.0938 1.1061 1.1061 1.1050 1.1052 1.1051 1.1051
irintensity: 5.5679 0.7806 0.5046 14.0909 1.3338 16.1311 1.6007 0.1989 12.8375 3.3631 2.8477 9.5461 2.5071 34.6388 13.7676 1.0953 30.7991 16.5122 4.5122 19.4979 25.4400 2.4101 4.0656 0.8794 0.0269 5.7818 14.6308 3.3024 21.7865 0.2329 9.3040 88.2984 20.8114 4.3902 65.6986 9.3497 88.8336 2.4989 12.2407 44.3698 4.8246 1.2725 0.3215 0.6568 10.7253 17.4598 1.2098 8.1254 3.4726 4.4478 1.6827 17.7582 0.0525 14.5181 111.5120 30.9602 12.8571 5.2616 7.6179 16.6919 4.3593 131.4874 54.0161 93.3118 0.1075 21.6972 7.1198 2.8777 0.9716 10.4084 6.6115 0.7415 0.4677 4.5593 2.9016
temp: 298.150 k
press: 1.00000 atm
elementType: 16 16 16 8 8 8 8 6 6 6 6 6 6 1 1 1 1 1 1 1 1 1 1 1 1 1 1
symmnumber: 1
zpe: 520420.2 jmol-1
zpe.correction: 0.198218 hartree
zpe.thermalcorrener: 0.214423 hartree
zpe.thermalcorrenthalpy: 0.215368 hartree
zpe.thermalcorrgfe: 0.154933 hartree
zpe.sumelectzpe: -1730.730794 hartree
zpe.sumelectthermal: -1730.714588 hartree
zpe.sumelectthermalent: -1730.713644 hartree
zpe.sumelectthermalfe: -1730.774078 hartree
dipole: 0.0170 -2.0607 0.0107
dipole: 2.0608
quadrupole: -76.0218 -127.2398 -94.2569
quadrupole: 0.0075 -7.8244 0.1076
quadrupole: 23.1510 -28.0670 4.9159 0.0075 -7.8244 0.1076
hfenergy: -1730.9290114 hartree
pointgroup: C01 [X(C6H14O4S3)]
dipole: 0.0061366 0.8107569 -0.0000849 debye
polarizability: 188.2636629|0.0914047|129.6787556|-6.5774277|0.0070275|128.3086697 unknown
InChI: InChI=1S/C6H14O4S3/c1-11(7)3-5-13(9,10)6-4-12(2)8/h3-6H2,1-2H3
charge 0 multiplicity 1
27 atoms
S  -0.001091 0.993516 0.003279
S  -3.506673 -0.847419 -0.788172
S  3.505892 -0.843962 0.781727
O  -1.219372 1.839853 0.715828
O  1.21412 1.844389 -0.709168
O  -2.489512 -1.900797 0.0471
O  2.485105 -1.895958 -0.051067
C  -0.805839 -0.191323 -1.315025
C  0.80767 -0.188615 1.322248
C  -2.147884 0.348213 -1.719779
C  2.152007 0.350584 1.720097
C  -4.070806 0.400916 0.549947
C  4.065695 0.405857 -0.556813
H  -0.047278 -0.269033 -2.106322
H  -0.942692 -1.155727 -0.750188
H  0.052137 -0.262123 2.116865
H  0.940651 -1.154454 0.759461
H  -2.372708 1.360006 -1.342029
H  -2.366112 0.247804 -2.792635
H  2.374372 1.362853 1.34211
H  2.375244 0.2498 2.791934
H  -3.172203 0.91568 0.926319
H  -4.560252 -0.209294 1.322494
H  -4.780788 1.103409 0.084951
H  3.165803 0.921358 -0.929064
H  4.552116 -0.203546 -1.331892
H  4.777599 1.107511 -0.093505
