program: Gaussian 09
title: 000126350
version: EM64L-G09RevD.01
frameworkgroup: C1[X(C20H32O6)]
method: RPBEPBE
basis: SDD
operation: Freq
keyword: #pfreq=noraman
keyword: PBEPBE/SDD
title: #p freq=noraman PBEPBE/SDD
converged: NO YES NO NO
title: Mulliken charges:
elementType: O O O O O O C C C C C C C C C C C C C C C C C C C C H H H H H H H H H H H H H H H H H H H H H H H H H H H H H H H H
charge: -0.270162 -0.455864 -0.487254 -0.425985 -0.480001 -0.244673 -0.107693 -0.134077 -0.136422 -0.446900 -0.518656 -0.088821 -0.228421 -0.178057 -0.160162 -0.191567 -0.212812 -0.492959 -0.496641 -0.395668 -0.494729 -0.164151 -0.158802 0.222582 -0.440971 -0.684331 0.244675 0.255067 0.235459 0.227021 0.204616 0.238976 0.231805 0.210744 0.249347 0.228768 0.336048 0.255996 0.401190 0.234600 0.226176 0.212693 0.210321 0.228973 0.199191 0.238264 0.210303 0.257217 0.275376 0.327862 0.221934 0.226474 0.206146 0.211029 0.239738 0.225552 0.191383 0.410251
chargesum: 0.00000
title: Mulliken charges with hydrogens summed into heavy atoms:
elementType: O O O O O O C C C C C C C C C C C C C C C C C C C C
charge: -0.270162 -0.119816 -0.086063 -0.098123 -0.069749 -0.244673 0.136982 0.120991 0.099037 -0.015264 -0.047875 0.121922 0.020927 0.050711 0.095833 0.043033 0.013365 -0.069944 -0.068477 0.052899 0.037864 0.057783 0.067673 0.222582 -0.023796 -0.027658
polarizability: 2.41359776e+02 1.16180764e+01 2.37842656e+02 2.66891290e+00 5.72205633e+00 2.26616648e+02
1716.lowfreq: -2.7585 -0.0011 -0.0006 -0.0002 6.0087 9.7005 18.4810 28.5410 38.6280
frequency: 18.2468 28.4902 38.5054 43.2652 52.5674 55.5440 65.6705 71.3609 80.8141 90.0460 92.7995 102.5651 116.5761 128.3863 130.5408 135.9204 173.9615 179.0222 182.1378 206.2624 226.7197 244.6626 262.9873 265.5965 272.5722 274.5644 282.7030 296.5245 315.7071 325.8313 341.0812 359.4939 373.7427 391.4453 404.0741 414.4323 415.7030 425.3794 460.1511 481.5336 485.0324 499.9242 509.9027 524.7937 546.7505 555.1858 577.6211 586.8015 615.3380 660.7900 740.0907 766.3619 781.3226 797.0502 809.7365 819.3881 826.4728 840.5298 850.4121 874.6241 879.8253 883.7304 899.5446 905.9876 925.8479 933.2422 939.3927 973.0364 977.5634 985.1065 989.3133 995.5701 998.5698 1011.4859 1014.7240 1033.0479 1044.0960 1051.3359 1052.6619 1060.2117 1064.7813 1076.2453 1087.7918 1111.9506 1112.8484 1121.2312 1129.2853 1134.5742 1161.8674 1180.9262 1185.3222 1188.3617 1203.6083 1209.8799 1221.5502 1227.8135 1238.6347 1242.5750 1245.5784 1253.8672 1263.5514 1277.0310 1287.0477 1290.5260 1294.3486 1294.9267 1298.3824 1302.4637 1310.1037 1317.2710 1322.0144 1325.9449 1334.2411 1340.1786 1342.0980 1351.3287 1355.5298 1359.4054 1366.3358 1370.7265 1375.1912 1387.5270 1403.3423 1432.6511 1447.7880 1460.1220 1460.6330 1460.7981 1465.7189 1472.0715 1481.5756 1501.6556 1665.7855 1674.7810 1685.6989 1686.6626 2952.1042 2960.1308 2970.9577 2972.1800 2984.7432 2988.0646 2997.7667 2999.9429 3004.5380 3009.6097 3013.5773 3018.6729 3021.5024 3026.1966 3027.5509 3040.1651 3050.7651 3052.0934 3058.4499 3059.1216 3067.2681 3068.4183 3070.8269 3072.4347 3077.3894 3079.4878 3082.4190 3091.4041 3399.2789 3470.9082 3538.5814 3557.4471
redmass: 4.9483 5.0621 5.5703 3.6826 4.1829 4.7048 4.6661 9.7096 4.3020 3.3432 4.2346 4.1974 3.7809 3.2671 2.9858 2.7201 3.6901 4.4260 4.2286 2.5709 1.9675 2.3279 2.0854 1.5798 2.5259 1.6220 2.5428 1.1036 2.0829 2.4942 4.5653 3.6863 3.4948 2.9267 3.1040 2.7469 4.0709 2.6281 2.7336 2.4989 2.9886 2.7139 3.6586 2.7941 3.7790 2.9308 3.9308 2.6322 1.3677 1.2820 4.7865 2.2948 1.3372 2.3598 1.6558 2.0409 2.2939 2.3046 2.2287 2.2003 2.8510 2.5787 2.8851 2.1971 2.5912 3.3414 2.2951 1.2034 1.9386 2.0789 1.3215 1.3840 2.1239 2.3794 2.2824 2.8445 2.1097 2.8961 3.2944 2.1996 2.2888 1.7750 1.9869 2.7698 2.5269 2.3454 1.9830 2.0908 1.1691 1.2433 1.5695 1.2427 1.2726 1.3390 1.3393 1.2665 1.2291 1.2762 1.2113 1.4191 1.2871 1.2645 1.2698 1.2721 1.2541 1.2534 1.2709 1.2922 1.2502 1.3180 1.2116 1.2597 1.2721 1.4189 1.3668 1.4111 1.3966 1.4027 1.5272 1.2788 1.2163 1.4512 1.6069 1.0863 1.1035 1.0953 1.0965 1.0952 1.0858 1.0821 1.0450 1.0547 7.6197 6.4442 6.6452 6.5236 1.0360 1.0602 1.0590 1.0618 1.0790 1.0613 1.0674 1.0648 1.0646 1.0816 1.0805 1.0973 1.0842 1.0971 1.0980 1.0971 1.0894 1.0988 1.0974 1.1018 1.0962 1.0984 1.1017 1.0955 1.0908 1.0908 1.0898 1.0872 1.0669 1.0642 1.0660 1.0661
irintensity: 0.1421 0.1687 0.0345 1.4882 0.2446 0.3174 0.7223 1.4262 0.8813 0.4545 3.4386 1.4222 0.7942 0.2806 0.6121 1.8504 7.7509 5.3381 7.0282 1.2728 5.4348 20.7015 14.1051 99.6251 1.4570 26.8013 6.5570 127.6779 1.5064 13.1907 8.2838 6.3922 1.7807 5.8194 6.3693 2.4090 8.0275 5.1245 10.7575 22.0731 2.5191 3.7842 24.6915 4.7670 15.4789 8.0547 8.3457 39.8899 157.3552 197.3176 27.4594 8.3464 3.9045 13.3550 10.1648 21.5819 5.7864 10.3297 12.9541 2.1499 24.3769 39.8971 61.8810 18.6655 47.8810 6.5967 5.5482 69.5845 17.2652 88.5295 24.2705 32.7897 75.9110 78.3939 5.7849 41.5170 45.0657 96.8237 57.5535 18.6733 140.3401 2.6371 7.7501 0.1290 3.0144 21.9198 1.4130 19.7839 9.1836 16.8568 1.8914 9.1653 24.8810 46.7830 8.5734 21.1239 1.3097 12.5482 0.1503 1.8664 3.8273 7.4691 9.9928 2.2328 1.2427 2.5433 0.8368 2.5577 14.5723 3.1920 0.6277 3.9081 1.4742 22.3779 2.0619 7.2663 6.6257 27.5797 8.8553 46.3451 3.3980 4.4786 18.6455 46.9243 11.6170 13.4336 20.6320 7.7868 7.7408 15.6288 9.9122 13.3122 137.2877 0.0355 0.2164 0.2894 45.4866 38.7124 28.4017 46.4704 2.3538 14.0423 15.8752 35.4639 16.5435 22.3808 89.5030 32.3411 42.5010 3.6907 8.6432 8.3835 18.1398 29.2196 4.3091 18.9556 43.9353 29.6732 23.7578 0.5206 14.8601 53.7600 61.6760 27.6053 190.1076 155.6736 10.2318 2.3259
temp: 298.150 k
press: 1.00000 atm
elementType: 8 8 8 8 8 8 6 6 6 6 6 6 6 6 6 6 6 6 6 6 6 6 6 6 6 6 1 1 1 1 1 1 1 1 1 1 1 1 1 1 1 1 1 1 1 1 1 1 1 1 1 1 1 1 1 1 1 1
symmnumber: 1
zpe: 1284180.1 jmol-1
zpe.correction: 0.489118 hartree
zpe.thermalcorrener: 0.518469 hartree
zpe.thermalcorrenthalpy: 0.519414 hartree
zpe.thermalcorrgfe: 0.428186 hartree
zpe.sumelectzpe: -1230.549794 hartree
zpe.sumelectthermal: -1230.520443 hartree
zpe.sumelectthermalent: -1230.519498 hartree
zpe.sumelectthermalfe: -1230.610726 hartree
dipole: -0.6176 0.1083 -4.0241
dipole: 4.0726
quadrupole: -153.4498 -148.0378 -168.3649
quadrupole: -3.8433 0.4528 -3.7229
quadrupole: 3.1677 8.5797 -11.7474 -3.8433 0.4528 -3.7229
hfenergy: -1231.038912 hartree
pointgroup: C01 [X(C20H32O6)]
dipole: 0.070365 0.3531089 -1.5613232 debye
polarizability: 244.7050451|6.9344086|230.2569452|8.6134303|6.7117396|230.8570892 unknown
InChI: InChI=1S/C20H32O6/c1-2-3-6-9-15(21)12-13-18-16(17(22)14-20(25)26-18)10-7-4-5-8-11-19(23)24/h3-4,6-7,12-13,15-18,20-23,25H,2,5,8-11,14H2,1H3
charge 0 multiplicity 1
58 atoms
O  -0.835541 -1.973533 -0.647725
O  -4.830692 -1.005405 0.44388
O  -1.755952 -0.702244 -2.494612
O  1.905066 0.056445 4.078638
O  0.853376 0.400486 -2.30231
O  1.800692 1.771331 -0.69279
C  -2.479659 -0.789629 0.906451
C  -3.519921 -0.873576 -0.230354
C  -1.018033 -0.898442 0.38252
C  -3.249434 -2.055512 -1.178197
C  -2.641996 0.53275 1.734385
C  -1.823875 -1.941634 -1.730859
C  -0.041358 -1.255622 1.476161
C  -2.568044 1.784298 0.878282
C  1.020613 -0.493276 1.836038
C  -1.506954 2.630968 0.78568
C  2.018548 -0.857719 2.910779
C  -1.454134 3.838697 -0.128703
C  3.480223 -0.854012 2.374045
C  -0.239586 3.844011 -1.105686
C  -0.141149 2.59099 -2.012867
C  3.699114 -1.870028 1.273541
C  4.019235 -1.569203 -0.011965
C  0.925267 1.606395 -1.569435
C  4.157868 -2.581473 -1.130712
C  3.096423 -2.362922 -2.241962
H  -2.679512 -1.646558 1.582091
H  -3.494189 0.054437 -0.832845
H  -0.742871 0.067151 -0.080472
H  -3.346222 -3.012145 -0.632951
H  -3.966702 -2.055185 -2.021076
H  -3.626204 0.483772 2.23475
H  -1.862805 0.558114 2.518437
H  -1.537692 -2.811972 -2.352577
H  -0.224842 -2.220002 1.9734
H  -3.45616 2.005321 0.264982
H  -5.540258 -1.047323 -0.246377
H  1.2166 0.455689 1.311087
H  -0.800729 -0.461823 -2.666398
H  -0.612681 2.443619 1.401992
H  1.776868 -1.84498 3.341931
H  -1.394422 4.767818 0.475874
H  -2.396248 3.89898 -0.709171
H  4.141335 -1.057802 3.239807
H  3.723439 0.161681 2.000512
H  0.69791 3.934755 -0.525442
H  -0.311178 4.748629 -1.73792
H  0.106143 2.872245 -3.055925
H  -1.1034 2.045965 -2.07035
H  2.096932 0.979737 3.768899
H  3.547834 -2.926089 1.549742
H  4.155612 -0.510822 -0.290375
H  5.16765 -2.513339 -1.584686
H  4.057223 -3.604858 -0.722125
H  2.075718 -2.450716 -1.821375
H  3.197194 -3.11213 -3.048442
H  3.222552 -1.365134 -2.709923
H  1.537111 -0.248272 -1.973196
