program: Gaussian 09
title: 000126238
version: EM64L-G09RevD.01
frameworkgroup: C1[X(C12H10INO2)]
method: RPBEPBE
basis: SDD
operation: Freq
keyword: #p
keyword: freq=noraman
keyword: PBEPBE/SDD
title: #p freq=noraman PBEPBE/SDD
converged: YES YES NO NO
title: Mulliken charges:
elementType: I O O N C C C C C C C C C C C C H H H H H H H H H H
charge: 0.090280 -0.198913 -0.183439 -0.204188 -0.362634 -0.610007 0.595245 0.187212 0.180598 -0.531451 -0.387891 -0.257795 -0.251485 -0.158756 -0.227930 -0.232106 0.256236 0.264940 0.252736 0.258775 0.250746 0.274832 0.275461 0.249285 0.233022 0.237228
chargesum: 0.00000
title: Mulliken charges with hydrogens summed into heavy atoms:
elementType: I O O N C C C C C C C C C C C C
charge: 0.090280 -0.198913 -0.183439 -0.204188 0.158542 -0.098495 0.595245 0.187212 0.180598 -0.531451 -0.137145 0.017036 0.023976 0.090528 0.005091 0.005122
polarizability: 1.79492012e+02 8.38341416e+00 2.13280844e+02 1.88867586e+01 -3.30937801e+00 7.38576132e+01
1716.lowfreq: 0.0003 0.0006 0.0007 2.5455 7.0106 8.0587 18.2466 25.9978 57.0698
frequency: 18.2055 25.9315 57.0385 61.7066 98.6683 125.7591 144.9780 201.3658 228.0554 251.1529 269.9330 295.2195 323.9150 388.6697 401.4972 443.5598 521.1899 547.4414 564.2328 610.0870 628.8736 639.3342 689.1121 714.1834 737.2134 746.7699 762.4473 778.2760 817.4118 836.8257 874.7917 935.4732 938.5715 953.9067 990.5274 993.1416 1018.2613 1030.5358 1039.7987 1052.4929 1100.4825 1125.3620 1137.8916 1175.4664 1215.0186 1241.2328 1282.0053 1287.0499 1307.2046 1328.5091 1349.3243 1365.8366 1380.6735 1419.1357 1455.9165 1458.5575 1483.3945 1567.8347 1579.8605 1595.5690 1620.5890 1675.2454 3008.8739 3023.1878 3066.9883 3093.9459 3125.4613 3140.1543 3157.8604 3172.9089 3204.8005 3233.3198
redmass: 11.1753 9.1019 5.7603 4.6796 5.4230 5.3962 8.0739 3.6435 6.5813 2.9934 6.4450 4.2400 4.8683 9.0766 2.7545 3.3390 3.7718 3.9132 6.9148 4.5282 3.0232 5.9384 7.6670 4.6937 6.8354 2.7932 1.5370 1.2610 2.1374 3.2392 1.4397 2.4445 1.3119 1.4052 1.3433 7.2645 3.1915 1.9874 2.1250 2.1127 2.5457 2.3042 1.5915 1.0678 2.2405 1.6225 1.6899 1.3570 1.3684 1.2994 2.8074 6.2994 1.6574 2.0937 1.7018 1.3951 1.0996 5.8865 6.9258 6.7645 11.2963 10.6287 1.0593 1.0589 1.1025 1.1064 1.0874 1.0892 1.0948 1.0997 1.0895 1.1106
irintensity: 0.0519 0.3719 0.4897 1.3387 1.5074 3.1828 6.1315 0.3627 1.2639 3.8715 4.1146 0.0232 12.8925 13.9539 0.2996 13.8768 4.7970 0.1987 4.9893 4.3984 3.5606 16.0598 31.4250 0.8359 0.2987 27.5929 55.5530 11.8229 59.8318 15.7399 0.8990 8.4564 0.0523 1.0926 0.1388 49.7765 24.1969 10.4130 2.2984 3.3796 44.0849 0.1298 16.6526 0.4062 0.2999 0.3041 0.2816 3.1431 2.2318 43.7941 207.7825 1.0558 79.0427 17.8205 8.2943 38.4828 16.7509 7.2579 6.7463 2.7526 405.1340 1.3689 5.6034 24.9142 2.2984 2.7093 4.1895 7.3674 15.1142 17.9839 0.0030 1.1788
temp: 298.150 k
press: 1.00000 atm
elementType: 53 8 8 7 6 6 6 6 6 6 6 6 6 6 6 6 1 1 1 1 1 1 1 1 1 1
symmnumber: 1
zpe: 503246.3 jmol-1
zpe.correction: 0.191676 hartree
zpe.thermalcorrener: 0.206125 hartree
zpe.thermalcorrenthalpy: 0.207069 hartree
zpe.thermalcorrgfe: 0.146356 hartree
zpe.sumelectzpe: -678.850469 hartree
zpe.sumelectthermal: -678.836021 hartree
zpe.sumelectthermalent: -678.835076 hartree
zpe.sumelectthermalfe: -678.895789 hartree
dipole: -0.9553 1.3229 -0.2580
dipole: 1.6521
quadrupole: -85.4571 -111.3004 -109.8094
quadrupole: 10.2006 5.0176 3.3820
quadrupole: 16.7319 -9.1114 -7.6204 10.2006 5.0176 3.3820
hfenergy: -679.0421454 hartree
pointgroup: C01 [X(C12H10I1N1O2)]
dipole: 0.2297572 -0.6035608 -0.0733914 debye
dipolederiv: -0.0652459 -0.1325392 0.0189962 -0.1391103 -0.4282382 0.051783 0.0144756 0.0501263 -0.0127755 -0.5049004 -0.2300531 -0.01668 0.1260864 -0.9550693 -0.0939767 0.0187948 -0.032181 -0.3288842 -0.4653388 0.167041 0.0540993 -0.1817826 -0.9115087 -0.1086567 -0.0200271 -0.1522086 -0.3401378 -1.2648442 -0.0062798 0.0775146 -0.0334851 -1.0466785 -0.1468551 0.0921949 -0.1233992 -0.2535414 0.7619845 -0.0166344 -0.0004003 -0.005674 0.1014517 -0.0268523 0.0908114 -0.0540058 0.2220397 -0.1608379 -0.0385083 0.0086991 -0.0226962 0.0929272 -0.0131243 -0.1185918 0.0083938 0.037343 0.2648193 -0.1744329 -0.0097588 0.0257116 -0.369292 0.0175525 -0.1103455 0.0495281 -0.021008 0.9191043 0.0333196 -0.0916787 -0.392651 1.3352772 0.1859326 -0.1631474 0.1487254 0.2904513 0.9289724 0.0386769 -0.0982702 0.508739 1.2754449 0.1629319 -0.0484233 0.1675332 0.2845093 -0.0027886 0.385441 -0.0672492 0.3020229 0.9918177 -0.1175379 -0.0426306 -0.0974864 -0.1592444 -0.0734758 0.0808508 -0.0441982 -0.1108991 0.0466797 0.0165797 -0.0160929 -0.0242731 -0.1356632 -0.2481068 -0.2261346 -0.0403898 -0.1700731 -0.0084426 0.0487447 0.0004884 0.0708648 -0.1267907 -0.212983 0.2461564 0.0298892 0.1768403 -0.0048551 -0.012425 0.0523302 -0.0359914 -0.1457186 -0.0770495 -0.1222815 -0.0038998 -0.2317023 -0.2772919 0.0638485 0.003174 0.0262515 -0.0870709 -0.0406039 0.0355937 -0.025766 0.0513342 0.071257 -0.0056323 -0.0222845 -0.0094188 -0.1352948 0.0382651 -0.0531345 -0.0564839 0.0586007 0.0229082 -0.0169809 -0.050011 0.0133229 -0.1396823 0.0003136 -0.0110058 0.0116645 -0.0416267 0.0016864 0.1140875 0.0131904 0.0362834 0.0138479 0.0645483 -0.0147978 0.0013994 0.028131 0.017152 -0.088859 0.0218375 -0.0303642 0.051783 0.0482978 0.0345468 0.0251326 0.0554242 -0.043456 -0.1008643 0.0339336 -0.0253351 0.0338771 0.0299926 -0.0332586 0.0109971 -0.051134 0.0085984 0.1050235 0.0145802 0.0497131 0.0194015 0.0277221 0.0835059 0.0393499 0.0804604 -0.0366341 -0.0112669 0.0387857 -0.0168683 0.1341735 0.0241085 0.0331867 0.0364376 0.0597019 0.0733308 -0.0296357 0.0442865 -0.0240678 0.1693855 0.0154938 -0.0362164 0.0271949 -0.0646432 0.0756236 -0.0024327 0.0284642 -0.0084016 0.1774639 0.0433051 0.0624401 0.0246983 0.0898358 -0.0036158 -0.0191875 0.0280879 -0.0146818 0.1503358 0.0511326 -0.0702114 0.0244604 -0.0880561 -0.0857867 0.0190884 0.0294171 0.0174195 0.1525383 -0.101885 -0.0352708 0.0642416 -0.0293549 0.0567142 0.008715 0.0667018 0.0105211 0.1486619 unknown
polarizability: 186.2673723|14.900422|207.307052|-16.9034858|2.4999986|73.0560447 unknown
InChI: InChI=1S/C12H10INO2/c13-10-4-2-1-3-9(10)7-8-14-11(15)5-6-12(14)16/h1-6H,7-8H2
charge 0 multiplicity 1
26 atoms
I  -1.883793 2.906014 -0.348924
O  2.265907 -2.364056 -0.153237
O  2.481626 2.277951 0.531849
N  1.991834 -0.039629 0.271192
C  0.55452 -0.0314 0.577306
C  -0.316742 -0.135371 -0.707458
C  -1.793616 -0.234401 -0.365743
C  2.732095 -1.199195 -0.074799
C  2.836602 1.104847 0.263696
C  -2.641011 0.885634 -0.153018
C  -2.37847 -1.522823 -0.210592
C  4.149879 -0.739016 -0.312399
C  4.210514 0.60642 -0.116785
C  -4.004338 0.73928 0.188831
C  -3.735515 -1.690098 0.134356
C  -4.552576 -0.554979 0.333669
H  0.334955 -0.886055 1.241693
H  0.337669 0.907845 1.115206
H  -0.007788 -1.038474 -1.263334
H  -0.115403 0.745082 -1.343462
H  -1.742956 -2.401973 -0.372875
H  4.941638 -1.43392 -0.592512
H  5.063672 1.28007 -0.197704
H  -4.632772 1.62168 0.339756
H  -4.153199 -2.696702 0.242426
H  -5.609732 -0.66653 0.597261
