program: Gaussian 09
title: 000126234
version: EM64L-G09RevD.01
frameworkgroup: C1[X(C9H13NO3)]
method: RPBEPBE
basis: SDD
operation: Freq
keyword: #p
keyword: freq=noraman
keyword: PBEPBE/SDD
title: #p freq=noraman PBEPBE/SDD
converged: YES YES NO NO
title: Mulliken charges:
elementType: O O O N C C C C C C C C C H H H H H H H H H H H H H
charge: -0.419048 -0.491304 -0.431844 -0.546949 -0.648970 -0.092039 0.492364 -0.699627 0.090022 -0.538377 0.137943 -0.471964 0.174613 0.222115 0.199955 0.225829 0.244119 0.187062 0.237849 0.228156 0.260912 0.259991 0.272797 0.353941 0.369940 0.382515
chargesum: 0.00000
title: Mulliken charges with hydrogens summed into heavy atoms:
elementType: O O O N C C C C C C C C C
charge: -0.065107 -0.121364 -0.049329 -0.026046 -0.226900 0.133790 0.492364 -0.030597 0.090022 -0.310221 0.137943 -0.199167 0.174613
polarizability: 1.61034508e+02 6.26445620e+00 1.19335711e+02 -1.18090665e+01 6.91179501e+00 7.21404180e+01
1716.lowfreq: -13.0681 -10.8054 -0.0007 0.0004 0.0008 8.7179 44.2904 58.3014 65.7387
frequency: 43.7840 58.2355 65.6188 138.5335 197.9396 212.5026 217.7313 235.5201 262.1579 274.8297 284.5989 299.9286 314.4098 338.5540 376.8861 415.7975 429.9204 446.3648 458.2067 484.4060 526.8080 571.6722 590.2815 652.9510 694.3854 714.5970 742.7803 810.9524 822.0443 848.2830 860.7484 889.9928 935.8370 989.5806 1059.3528 1072.2964 1107.9100 1118.1902 1133.5771 1159.2296 1175.5444 1217.8077 1223.8854 1237.6396 1281.0751 1295.5639 1324.9773 1339.9374 1359.5063 1386.0057 1411.7317 1450.6941 1470.2490 1471.8773 1482.2233 1514.9896 1613.8452 1637.0304 1644.8059 2925.6977 2968.9217 2977.2534 3019.2942 3072.5737 3106.4408 3111.7737 3189.7493 3443.1153 3526.6513 3572.3737 3587.1606 3628.1587
redmass: 2.9571 4.3167 4.3880 7.1215 2.4182 1.3539 1.2389 1.0844 2.5459 4.0537 4.5039 1.3384 2.9035 4.2703 3.2384 3.1382 3.1202 2.2309 4.0151 1.1284 3.6737 1.6453 3.6872 7.7930 4.9940 3.9982 5.6736 1.8282 2.8376 2.3276 1.5046 1.4978 1.8505 1.3869 3.9283 1.6441 2.3285 1.4981 1.8286 1.3270 1.6083 1.7998 1.7547 1.5216 1.3976 1.5814 1.5333 2.4058 1.4319 1.2771 4.2265 2.5631 1.1098 1.0534 1.2299 3.9191 6.6509 1.0999 7.1529 1.0677 1.0569 1.0682 1.0930 1.0925 1.1005 1.0913 1.0928 1.0444 1.0648 1.0977 1.0653 1.0666
irintensity: 0.7697 0.4893 1.8714 0.1334 51.2702 70.4240 35.1703 72.6333 8.2657 4.2045 10.5198 90.7338 8.9661 13.2096 8.5588 5.8305 1.6214 9.4732 22.2127 121.9130 11.5007 340.5630 18.2466 8.8819 21.4590 6.2221 9.4891 6.6477 54.9456 4.4955 41.1731 9.5775 2.5017 2.1436 30.4322 23.3164 114.8938 297.0992 38.7070 59.7908 14.8444 13.0771 69.9503 18.6873 2.8177 188.5471 5.4906 4.2548 0.8403 22.7139 68.0354 53.1699 8.8708 6.4345 13.4495 121.7305 29.2336 42.3236 33.2213 57.8594 6.4137 28.8295 33.0437 37.9684 26.2045 13.8233 0.2617 2.1547 87.1980 0.1916 22.0241 45.2225
temp: 298.150 k
press: 1.00000 atm
elementType: 8 8 8 7 6 6 6 6 6 6 6 6 6 1 1 1 1 1 1 1 1 1 1 1 1 1
symmnumber: 1
zpe: 547446.7 jmol-1
zpe.correction: 0.208511 hartree
zpe.thermalcorrener: 0.222576 hartree
zpe.thermalcorrenthalpy: 0.223520 hartree
zpe.thermalcorrgfe: 0.168295 hartree
zpe.sumelectzpe: -630.166450 hartree
zpe.sumelectthermal: -630.152385 hartree
zpe.sumelectthermalent: -630.151441 hartree
zpe.sumelectthermalfe: -630.206666 hartree
dipole: 2.2457 -3.7898 -2.4934
dipole: 5.0619
quadrupole: -79.7933 -71.9117 -80.0225
quadrupole: 8.3748 -6.2258 1.1971
quadrupole: -2.5508 5.3308 -2.7800 8.3748 -6.2258 1.1971
hfenergy: -630.3749614 hartree
pointgroup: C01 [X(C9H13N1O3)]
dipole: 0.945322 1.2926819 1.1838223 debye
dipolederiv: -0.5370347 0.4936914 0.1563196 0.4824102 -0.9639866 -0.0308895 0.2030863 -0.034204 -0.3447931 -0.6468718 0.5463764 0.1728497 0.6672374 -0.9691936 -0.0437622 0.1914668 -0.0493688 -0.3956869 -1.4880815 0.067329 -0.2298899 0.0491915 -0.1709664 0.1005283 -0.2939081 0.1069624 -0.4424134 -1.0834287 0.0254362 0.1664171 0.0701648 -0.1889097 0.0591746 0.3250289 0.0514287 -0.5185281 -0.1761306 0.0119475 0.0475708 -0.0336576 0.1207869 0.0093059 0.2901959 0.0147972 0.0448244 0.8712146 -0.009602 -0.0429453 -0.0267157 0.1827154 -0.0262627 -0.1896237 -0.060765 0.334217 0.0125929 -0.0486138 -0.0153879 0.2628121 -0.2657083 0.0178858 0.2180329 -0.0692914 -0.1340591 -0.049287 0.0207023 0.0071579 0.0602505 -0.0325633 0.1090443 0.0456566 0.1208454 0.0184066 0.4311433 -0.3874836 -0.0148972 -0.5621813 0.8217534 0.1063014 -0.1216595 0.1489733 0.0653414 0.0366069 0.0658069 0.0921578 -0.1236026 -0.0214674 0.0178911 0.0161729 0.0599167 -0.1328481 0.0822437 -0.432839 -0.1375622 -0.8541619 0.748577 0.0860552 -0.3032405 0.1636455 -0.0102819 -0.2726943 0.1306822 0.0150958 0.1267777 -0.0874356 0.066896 0.0102382 0.0826554 -0.1411589 1.3348877 -0.1719335 0.2682448 0.1880465 0.0488316 0.0279491 0.4374065 -0.051058 0.1514693 0.0225827 -0.0151794 -0.0208548 -0.0697902 -0.051879 -0.1478119 -0.03513 -0.0641125 -0.0090005 -0.0513983 0.0403257 -0.0411204 0.088119 -0.1335342 0.1440624 -0.0387369 0.0759916 0.0067295 0.0072769 -0.036159 -0.0390532 -0.0473213 -0.0944697 -0.0958548 -0.0315105 -0.0675208 -0.0393448 -0.0070652 -0.0444648 0.1312506 -0.0262465 0.0772147 0.0193504 0.132414 0.043425 -0.0563157 0.0735667 -0.0393641 -0.0347438 -0.039495 -0.0578001 -0.0779222 -0.0712605 -0.1503673 -0.0533256 -0.0876835 0.0563968 -0.0883821 0.0566408 0.0649156 -0.0003067 -0.1039694 -0.0142182 0.0820445 0.0669547 -0.051277 -0.0551961 -0.035711 -0.0598286 -0.0862072 -0.0463397 -0.089049 0.1114539 0.2671707 -0.0452404 -0.0678933 -0.0027529 0.0348602 0.0965616 -0.2015461 0.1523841 0.1857437 0.2537206 0.0565873 -0.0436392 -0.0013849 0.0888448 -0.109669 -0.1861937 -0.1300355 0.1519151 0.0835698 -0.0311088 -0.0349799 -0.036488 0.0384264 -0.0602978 -0.0405323 -0.0626944 0.1477376 0.1608555 -0.06089 -0.0959036 -0.0497119 0.3676127 -0.0482472 -0.1207591 -0.0347756 0.2692309 0.2322485 -0.1514345 -0.1122581 -0.1186005 0.3112684 -0.0602032 -0.0979875 -0.0744733 0.3426977 0.4630406 0.0103082 0.0176429 -0.0238291 0.1919355 -0.073572 0.0126985 -0.0690918 0.3659446 unknown
polarizability: 159.6566096|-10.4806462|117.7238064|12.7115962|12.119619|75.1302203 unknown
InChI: InChI=1S/C9H13NO3/c1-5(10)2-6-3-8(12)9(13)4-7(6)11/h3-5,11-13H,2,10H2,1H3
charge 0 multiplicity 1
26 atoms
O  0.539487 -2.430681 -0.307333
O  -2.701714 2.103021 0.438841
O  -3.684015 -0.14456 -0.691343
N  4.280409 -0.047683 0.094843
C  1.864467 -0.064362 0.903255
C  2.866639 0.109246 -0.302435
C  0.39575 -0.089146 0.513551
C  2.688756 1.478997 -0.983241
C  -0.190717 -1.24248 -0.080947
C  -0.437698 1.04595 0.700472
C  -1.783117 1.029069 0.301108
C  -1.543503 -1.270596 -0.484571
C  -2.342736 -0.132229 -0.296675
H  2.050721 0.764766 1.613783
H  2.148695 -0.991847 1.450661
H  2.645939 -0.676345 -1.054056
H  3.363211 1.557394 -1.852319
H  2.938497 2.297993 -0.278359
H  1.648442 1.622737 -1.320101
H  -0.012843 1.945921 1.164731
H  4.520615 -0.957879 0.50133
H  4.642189 0.731336 0.655648
H  -1.96561 -2.171271 -0.935735
H  1.453992 -2.350759 0.060194
H  -2.285239 2.890773 0.861441
H  -4.082317 0.740835 -0.479844
