program: Gaussian 09
title: 000126233
version: EM64L-G09RevD.01
frameworkgroup: C1[X(C13H14O4)]
method: RPBEPBE
basis: SDD
operation: Freq
keyword: #pfreq=noraman
keyword: PBEPBE/SDD
title: #p freq=noraman PBEPBE/SDD
converged: YES YES NO NO
title: Mulliken charges:
elementType: O O O O C C C C C C C C C C C C C H H H H H H H H H H H H H H
charge: -0.269027 -0.218295 -0.447034 -0.210954 -0.123578 -0.112921 -0.437055 -0.117526 -0.216129 -0.555287 0.401802 0.184214 -0.406091 -0.417158 -0.226136 -0.224648 -0.234432 0.278223 0.243885 0.269661 0.226651 0.238974 0.241323 0.281036 0.266144 0.362848 0.287638 0.240291 0.230577 0.230667 0.232336
chargesum: 0.00000
title: Mulliken charges with hydrogens summed into heavy atoms:
elementType: O O O O C C C C C C C C C C C C C
charge: -0.269027 -0.218295 -0.084186 -0.210954 0.154646 0.130963 0.059257 0.121448 0.025194 -0.008107 0.401802 0.184214 -0.118452 -0.176867 0.004441 0.006019 -0.002095
polarizability: 1.84564258e+02 2.37289298e+00 1.36783291e+02 -3.21725455e+00 1.19519655e+01 1.07173813e+02
1716.lowfreq: -7.2323 0.0007 0.0009 0.0010 5.7189 11.9857 39.9383 51.3511 79.8193
frequency: 39.8451 51.2808 79.8093 93.4272 119.4074 187.2715 207.0038 250.1687 286.2572 312.9362 333.1233 367.7486 379.7614 403.0514 404.5796 416.9777 477.6887 505.7756 526.2344 541.0737 613.6880 622.9255 630.5180 697.9040 708.3516 718.2048 751.1470 794.0480 808.7750 838.7585 862.3490 870.1689 893.4007 916.3265 931.6930 942.7068 972.4075 984.2881 989.3359 994.8497 1001.7286 1024.7928 1028.2646 1046.4835 1062.1545 1082.2734 1095.7010 1134.7687 1173.7332 1175.5696 1184.8717 1197.8290 1214.5450 1226.6169 1260.6258 1270.7574 1287.3339 1307.6976 1311.6718 1327.3095 1340.4796 1343.7722 1351.2025 1361.0651 1372.7444 1388.6757 1425.2442 1440.0064 1443.1481 1482.5528 1592.6120 1612.9167 1659.0482 2947.8097 2978.0958 3004.0015 3020.5950 3065.4170 3069.8336 3089.0919 3096.2363 3117.7581 3130.7750 3144.5303 3160.9270 3172.2735 3520.6753
redmass: 3.9681 8.2423 4.8502 5.6157 4.5770 3.7707 8.0902 4.5570 3.5136 1.5482 2.4388 3.6610 3.0190 3.9755 4.0920 3.6373 4.9801 3.9636 3.5841 4.4088 6.3834 6.0659 4.7033 4.3260 2.1833 3.6630 2.2052 4.3369 3.3548 3.4741 1.2484 3.1304 2.2907 3.6511 1.5674 2.5273 4.2541 1.4605 5.6731 3.1970 1.3596 2.4950 2.2885 2.9172 2.3386 1.5799 1.8865 2.5627 1.0577 1.1544 1.1142 1.2677 1.9683 1.1889 1.4892 1.6985 1.4504 1.5137 1.3884 1.3253 1.3378 1.3485 1.4076 1.5870 1.8674 4.2346 1.0728 2.1357 1.0941 2.3329 6.1312 6.0679 12.4085 1.0829 1.0851 1.0638 1.0629 1.0890 1.0962 1.0894 1.1006 1.0880 1.0869 1.0928 1.0968 1.0983 1.0657
irintensity: 0.2495 2.4796 1.2772 1.0670 7.3820 2.3003 4.2292 3.3343 21.2026 85.2926 41.9225 1.1424 5.3033 6.2481 0.4629 1.3131 2.4286 8.8698 6.6740 3.7376 0.6036 2.2755 1.0696 3.8851 41.3569 62.4551 19.3707 15.0791 1.8365 18.8100 0.1971 1.1326 3.2239 3.4594 1.6503 19.9165 30.3132 6.5628 0.4433 82.6294 3.5956 117.4150 57.1546 85.8179 50.8166 5.5031 30.8135 43.8149 0.9901 23.0262 4.7110 41.1101 12.9307 2.2079 28.2057 30.7164 13.1735 32.6302 7.2507 10.8554 4.0002 8.5333 10.3865 2.3735 9.4161 2.0505 18.2396 9.8969 26.1691 16.6975 1.3063 4.5230 307.9590 18.5094 40.8593 4.0629 20.9735 30.1589 9.3604 15.9706 8.4857 6.3363 0.9801 24.2024 23.4769 9.7975 26.0835
temp: 298.150 k
press: 1.00000 atm
elementType: 8 8 8 8 6 6 6 6 6 6 6 6 6 6 6 6 6 1 1 1 1 1 1 1 1 1 1 1 1 1 1
symmnumber: 1
zpe: 647607.3 jmol-1
zpe.correction: 0.246661 hartree
zpe.thermalcorrener: 0.260742 hartree
zpe.thermalcorrenthalpy: 0.261686 hartree
zpe.thermalcorrgfe: 0.205362 hartree
zpe.sumelectzpe: -803.411393 hartree
zpe.sumelectthermal: -803.397311 hartree
zpe.sumelectthermalent: -803.396367 hartree
zpe.sumelectthermalfe: -803.452691 hartree
dipole: -2.6276 -2.5474 -1.1497
dipole: 3.8361
quadrupole: -95.7669 -103.9990 -101.2321
quadrupole: -15.3767 -8.1340 3.7244
quadrupole: 4.5658 -3.6664 -0.8994 -15.3767 -8.1340 3.7244
hfenergy: -803.6580531 hartree
pointgroup: C01 [X(C13H14O4)]
dipole: 1.0375883 -0.9818608 0.487004 debye
polarizability: 184.3730173|-3.1287459|135.3897489|-4.6824896|-13.4511444|108.7585952 unknown
InChI: InChI=1S/C13H14O4/c14-11-7-9-6-10(17-11)12(15)13(16-9)8-4-2-1-3-5-8/h1-5,9-10,12-13,15H,6-7H2
charge 0 multiplicity 1
31 atoms
O  -0.32713 -0.547705 1.310087
O  -2.685576 0.417644 -1.114519
O  0.241749 -1.811731 -1.455045
O  -3.545128 2.210991 -0.003885
C  -1.916828 -0.870849 -1.098706
C  -1.781332 -0.83864 1.367906
C  -2.203832 -1.692825 0.160762
C  -0.412682 -0.529409 -1.202502
C  0.093653 0.176713 0.097117
C  -2.633587 0.44819 1.421455
C  1.610429 0.274172 0.109354
C  -2.977087 1.10571 0.079122
C  2.398403 -0.733719 0.721237
C  2.250696 1.352186 -0.552576
C  3.809881 -0.660654 0.667356
C  3.660066 1.418849 -0.611536
C  4.4442 0.410585 -0.002725
H  -2.235414 -1.382001 -2.019623
H  -1.880445 -1.390067 2.316754
H  -1.607923 -2.619183 0.11548
H  -3.275256 -1.957341 0.220772
H  -0.256282 0.170648 -2.049894
H  -0.335465 1.201914 0.103267
H  -2.148477 1.210909 2.056245
H  -3.604581 0.221772 1.903364
H  1.222016 -1.699015 -1.343818
H  1.896574 -1.539132 1.265422
H  1.648728 2.144615 -1.015082
H  4.412747 -1.437584 1.150775
H  4.145085 2.258018 -1.122214
H  5.537696 0.465339 -0.04315
