program: Gaussian 09
title: 000126202
version: EM64L-G09RevD.01
frameworkgroup: C1[X(C5H7N3O2)]
method: RPBEPBE
basis: SDD
operation: Freq
keyword: #pfreq=noraman
keyword: PBEPBE/SDD
title: #p freq=noraman PBEPBE/SDD
converged: YES YES NO NO
title: Mulliken charges:
elementType: O O N N N C C C C C H H H H H H H
charge: -0.203679 -0.202354 -0.127724 0.092513 -0.659301 0.478827 -0.549907 0.365119 -0.366421 -0.738015 0.255488 0.297656 0.220936 0.253203 0.253672 0.314912 0.315076
chargesum: 0.00000
title: Mulliken charges with hydrogens summed into heavy atoms:
elementType: O O N N N C C C C C
charge: -0.203679 -0.202354 -0.127724 0.092513 -0.029313 0.478827 -0.294419 0.365119 -0.068765 -0.010204
polarizability: 1.47842815e+02 -4.18393567e+00 9.69794660e+01 1.20464797e-03 3.01662967e-03 3.92667231e+01
1716.lowfreq: -9.2184 -5.6961 -0.0006 -0.0006 0.0008 5.9694 78.4607 123.4545 181.2524
frequency: 78.4557 123.4536 181.2497 212.5703 219.6914 282.5858 289.3454 335.0655 370.7003 392.6068 411.4278 552.9484 566.8256 589.1764 607.0897 646.1290 698.1801 708.9668 777.9426 790.2188 972.7842 993.4262 1026.6317 1045.9344 1067.7125 1151.1072 1157.9725 1206.3373 1291.4561 1331.7511 1394.7913 1416.5768 1426.8719 1452.3169 1463.9008 1561.7212 1628.2182 1653.7406 2994.4514 3075.4083 3101.3779 3207.0932 3275.6267 3577.0359 3715.8269
redmass: 7.7489 5.6462 2.3480 5.8332 1.1850 2.9067 1.1673 2.2856 1.5304 4.9832 5.9221 3.9534 3.2188 5.2637 4.2152 2.7800 1.8329 10.0470 4.6979 1.5174 2.7660 1.5006 1.3908 1.4482 5.8131 3.0057 5.3783 1.4804 3.7446 4.0061 4.5465 1.3523 5.7184 1.0437 1.1797 4.8543 1.7186 2.4310 1.0364 1.0976 1.1000 1.0980 1.0981 1.0452 1.1043
irintensity: 0.0193 0.0148 5.5958 1.1767 0.4259 4.1914 122.7134 84.9301 110.0246 0.2728 5.1662 1.5988 0.6531 4.3639 5.8787 41.3942 38.3633 24.1752 4.0773 56.6194 7.4148 25.0763 3.1523 5.8175 2.9322 365.5837 311.7089 12.5262 38.2003 56.0018 194.7984 0.2090 32.1841 14.2703 4.4971 20.7448 9.1676 396.6075 16.9063 10.3420 15.0918 3.2918 13.6052 117.2819 29.8657
temp: 298.150 k
press: 1.00000 atm
elementType: 8 8 7 7 7 6 6 6 6 6 1 1 1 1 1 1 1
symmnumber: 1
zpe: 329120.8 jmol-1
zpe.correction: 0.125355 hartree
zpe.thermalcorrener: 0.135031 hartree
zpe.thermalcorrenthalpy: 0.135976 hartree
zpe.thermalcorrgfe: 0.090866 hartree
zpe.sumelectzpe: -508.570295 hartree
zpe.sumelectthermal: -508.560619 hartree
zpe.sumelectthermalent: -508.559675 hartree
zpe.sumelectthermalfe: -508.604784 hartree
dipole: -5.8590 1.9191 0.0064
dipole: 6.1653
quadrupole: -53.0187 -54.1131 -60.8040
quadrupole: 6.2586 -0.0262 0.0247
quadrupole: 2.9599 1.8655 -4.8254 6.2586 -0.0262 0.0247
hfenergy: -508.6956503 hartree
pointgroup: C01 [X(C5H7N3O2)]
dipole: -2.3380291 -0.6444757 0.0425242 debye
dipolederiv: -0.4386459 -0.1095501 0.0078645 -0.7026825 -0.9332598 0.0515742 0.0492205 0.0512479 -0.2204287 -1.143341 0.0762297 -0.0053521 0.6530738 -0.5404816 0.0245398 -0.048037 0.0249368 -0.1981908 -1.0345082 -0.5131501 0.034895 -0.9778834 -0.4339791 0.0369918 0.0689324 0.0365081 0.0815132 2.282325 0.4253379 -0.0310494 0.4426777 1.4098579 -0.0917325 -0.0295856 -0.0916539 0.1480331 -1.5607507 0.1506811 -0.0093806 0.5492629 -0.1917656 -0.0360011 -0.0353632 -0.0361609 -0.7308113 0.6489333 0.1598935 -0.010766 0.4530205 0.4295177 -0.0304275 -0.0316492 -0.0282226 -0.0164116 -0.5147257 -0.0146254 0.0014425 0.5061201 0.0143022 -0.0198649 -0.0342495 -0.0202595 -0.2698976 1.574289 -0.2296366 0.0155633 -0.60457 0.1601408 -0.0021825 0.0411089 -0.0021531 0.1345121 -0.4497422 0.0751712 -0.0037288 -0.2197158 -0.3004037 -0.003289 0.0143561 -0.0030823 -0.3360233 0.0168349 0.1590508 -0.0113431 0.0652235 -0.0052126 0.0059628 -0.0047581 0.0037021 0.0807552 0.0348281 -0.071133 0.0047372 -0.0636387 -0.006945 0.0143124 0.0044672 0.014358 0.1980498 0.0735497 -0.0202851 0.0012225 0.0354634 0.0730689 0.0134592 -0.0025207 0.0137187 0.2630345 0.0204281 -0.1591009 0.0119086 -0.0521829 -0.0707538 0.0137007 0.0041457 0.0139169 0.1153425 0.0274422 0.0565947 0.0838316 -0.0056126 0.0550487 0.0153181 0.0771109 -0.025412 -0.0212589 0.0265711 0.0440001 -0.0912211 -0.0174338 0.0564778 -0.0264462 -0.0753988 0.0142753 -0.0182766 0.1730968 -0.0233989 0.0012842 -0.1094142 0.1393966 0.0175742 0.0072181 0.0178829 0.3977314 0.2634156 -0.0060788 0.0000917 0.0482919 0.1449908 0.0165107 -0.0049978 0.0163978 0.3923271 unknown
polarizability: 148.1232896|1.7730643|96.4217528|-0.1306207|-3.9806511|39.5439621 unknown
InChI: InChI=1S/C5H7N3O2/c1-4-2-5(6)3-7(4)8(9)10/h2-3H,6H2,1H3
charge 0 multiplicity 1
17 atoms
O  1.896769 1.928657 -0.135389
O  2.64994 -0.242868 0.02067
N  0.370091 0.21231 -0.009823
N  1.723812 0.653828 -0.043662
N  -3.189616 0.78766 -0.052608
C  -0.086871 -1.138222 0.082457
C  -1.473088 -1.05516 0.075416
C  -1.874451 0.346046 -0.022298
C  -0.712623 1.120126 -0.074739
C  0.789638 -2.35222 0.16467
H  -2.14211 -1.913544 0.134456
H  -0.539568 2.187571 -0.149791
H  0.144615 -3.244411 0.231146
H  1.445028 -2.453059 -0.718298
H  1.455239 -2.327071 1.044995
H  -3.408994 1.776567 -0.119871
H  -3.957411 0.125688 -0.010332
