program: Gaussian 09
title: 000126223
version: EM64L-G09RevD.01
frameworkgroup: C1[X(C10H14N2O2S)]
method: RPBEPBE
basis: SDD
operation: Freq
keyword: #p
keyword: freq=noraman
keyword: PBEPBE/SDD
title: #p freq=noraman PBEPBE/SDD
converged: YES YES NO NO
title: Mulliken charges:
elementType: S O O N N C C C C C C C C C C H H H H H H H H H H H H H H
charge: 0.230031 -0.283186 -0.426580 -0.058474 -0.046478 -0.123465 -0.139456 -0.105787 -0.570398 -0.172990 -0.153448 0.092462 -0.388246 -0.689493 -0.718067 0.253561 0.230584 0.263636 0.298584 0.233256 0.233850 0.228033 0.236786 0.257075 0.276424 0.340940 0.237416 0.234582 0.228847
chargesum: 0.00000
title: Mulliken charges with hydrogens summed into heavy atoms:
elementType: S O O N N C C C C C C C C C C
charge: 0.230031 -0.283186 -0.085640 -0.058474 -0.046478 0.130096 0.091128 0.157850 -0.271814 0.060266 0.080403 0.092462 0.076572 -0.155994 -0.017221
polarizability: 1.97033016e+02 -1.87381860e+00 1.17088628e+02 -8.88135525e-01 -5.57181409e+00 1.17521303e+02
1716.lowfreq: -28.2282 -12.6281 -0.9479 -0.0011 -0.0010 -0.0007 6.2947 21.7121 46.9918
frequency: -18.7265 21.0663 46.9500 59.2291 84.0314 95.6771 111.5877 132.9260 175.5667 202.2030 210.7099 258.5066 303.6721 342.1308 354.1184 369.7025 376.8635 410.3284 440.5686 462.8764 506.4340 557.8381 598.9644 629.7438 670.6263 687.5828 714.1202 766.5378 776.1512 778.4927 798.0135 836.5819 926.9704 930.3678 950.3965 951.9485 955.2430 962.1364 965.7178 1028.9126 1032.2216 1054.4952 1064.1270 1084.7019 1131.3142 1159.3832 1180.0044 1195.5888 1203.6507 1218.4624 1236.9084 1250.1287 1281.4339 1293.6660 1316.5706 1331.9224 1344.5176 1360.7371 1381.0729 1396.9926 1399.3772 1446.0675 1452.2036 1464.6297 1469.6980 1481.8835 1632.9797 2979.8237 2994.8642 3010.5890 3050.1025 3051.4011 3064.2001 3083.4632 3086.3396 3096.7644 3105.4566 3125.3160 3137.6810 3158.5198 3526.5624
redmass: 6.0102 4.9502 6.0783 4.0831 3.8980 2.7373 1.0492 4.9656 6.5153 5.6356 5.3037 3.9366 5.1220 3.0582 2.3624 4.5520 1.4535 4.2512 6.2258 5.0620 4.5503 5.4597 4.0646 5.0107 7.3691 5.6555 3.7124 2.9526 1.2496 3.1890 2.2866 3.6963 4.7837 2.5774 2.1061 1.8851 3.2156 1.5545 1.9331 1.3162 2.8269 1.8392 1.2716 1.3456 1.5166 1.1702 1.0997 2.2738 1.2001 1.2756 1.4771 1.6633 2.1444 1.3763 1.2636 1.5545 1.3177 1.3706 1.6898 1.2476 2.7593 2.3281 1.0817 1.0591 1.1213 1.4930 6.4038 1.0373 1.0599 1.0560 1.0852 1.1026 1.0985 1.0866 1.1088 1.0989 1.0894 1.0861 1.0922 1.1008 1.0659
irintensity: 0.7611 2.8227 1.1667 2.2457 1.3103 1.1050 0.0249 2.0372 7.3640 0.7720 2.4542 5.2725 5.7721 12.2208 1.7009 4.0399 112.0599 6.9836 5.2306 2.4110 7.6114 1.2723 13.0101 6.9655 3.8404 0.1680 12.6469 12.9154 6.0346 22.1172 74.7277 4.4235 36.9345 11.5014 1.4883 25.4100 41.9479 1.9189 3.6440 3.7277 3.2026 0.1969 7.7677 0.0063 6.9742 12.0477 4.8570 1.4767 30.7423 18.8356 11.4706 2.3017 2.3163 3.9788 0.9501 30.1820 7.0307 27.6927 2.3404 26.0788 4.2919 37.4968 3.7811 4.6576 23.8570 3.8773 14.6444 16.7752 9.3811 26.9590 6.4230 3.7305 20.4957 9.3734 20.0513 19.4178 18.0528 7.7610 35.2737 23.5516 7.6370
temp: 298.150 k
press: 1.00000 atm
elementType: 16 8 8 7 7 6 6 6 6 6 6 6 6 6 6 1 1 1 1 1 1 1 1 1 1 1 1 1 1
symmnumber: 1
zpe: 590879.4 jmol-1
zpe.correction: 0.225054 hartree
zpe.thermalcorrener: 0.240335 hartree
zpe.thermalcorrenthalpy: 0.241279 hartree
zpe.thermalcorrgfe: 0.180914 hartree
zpe.sumelectzpe: -1046.163179 hartree
zpe.sumelectthermal: -1046.147899 hartree
zpe.sumelectthermalent: -1046.146955 hartree
zpe.sumelectthermalfe: -1046.207319 hartree
dipole: 1.7728 1.3463 1.2246
dipole: 2.5407
quadrupole: -90.8994 -101.0339 -99.7236
quadrupole: -11.7933 12.1384 -6.7583
quadrupole: 6.3196 -3.8149 -2.5047 -11.7933 12.1384 -6.7583
hfenergy: -1046.3882332 hartree
pointgroup: C01 [X(C10H14N2O2S1)]
dipole: -0.7427728 0.4540693 -0.4912127 debye
polarizability: 195.8651469|9.7974339|118.3359248|-0.7622941|5.5416833|117.4418753 unknown
InChI: InChI=1S/C10H14N2O2S/c1-10(11-12-10)4-5-15-7-3-2-6-9(14-6)8(7)13/h2-3,6-9,13H,4-5H2,1H3
charge 0 multiplicity 1
29 atoms
S  -0.015904 -0.561713 0.482331
O  -3.017427 -0.809043 1.46891
O  -2.951348 1.858002 -1.242324
N  4.495863 0.046477 -1.321373
N  5.173787 -0.423513 -0.316797
C  -3.398589 0.379144 0.638219
C  -3.871889 -0.980218 0.191239
C  -2.30087 1.045366 -0.186548
C  -1.312621 0.034472 -0.814651
C  -3.191104 -1.629269 -0.95823
C  -1.992927 -1.164563 -1.422295
C  4.025444 0.533798 0.072404
C  2.752993 -0.101519 0.612604
C  1.535281 0.233959 -0.276078
C  4.392998 1.944076 0.480636
H  -4.105271 1.069541 1.116899
H  -4.9007 -1.281687 0.416071
H  -1.744273 1.78305 0.413026
H  -0.713774 0.57189 -1.569726
H  -3.65621 -2.517616 -1.400349
H  -1.47464 -1.681549 -2.23799
H  2.575113 0.260907 1.642956
H  2.869553 -1.20065 0.671067
H  1.372129 1.3245 -0.334488
H  1.677367 -0.166876 -1.294316
H  -3.49317 1.250208 -1.811605
H  4.662823 1.981591 1.552972
H  5.24996 2.325468 -0.100213
H  3.54111 2.631269 0.32265
