program: Gaussian 09
title: 000126227
version: EM64L-G09RevD.01
frameworkgroup: C1[X(C9H15N5O3)]
method: RPBEPBE
basis: SDD
operation: Freq
keyword: #p
keyword: freq=noraman
keyword: PBEPBE/SDD
title: #p freq=noraman PBEPBE/SDD
converged: YES YES NO NO
title: Mulliken charges:
elementType: O O O N N N N N C C C C C C C C C H H H H H H H H H H H H H H H
charge: -0.493271 -0.484757 -0.294526 -0.447435 -0.393570 -0.446238 -0.031020 -0.628044 -0.066471 -0.099360 -0.447240 -0.106521 0.321851 0.085830 -0.710395 -0.048745 0.132594 0.275835 0.239154 0.210679 0.216493 0.315661 0.218792 0.321033 0.248643 0.206442 0.232146 0.301116 0.374175 0.352993 0.345137 0.299020
chargesum: 0.00000
title: Mulliken charges with hydrogens summed into heavy atoms:
elementType: O O O N N N N N C C C C C C C C C
charge: -0.119097 -0.131763 -0.294526 -0.131774 -0.072537 -0.145122 -0.031020 0.016113 0.209364 0.139794 -0.020068 0.112271 0.321851 0.085830 -0.023163 -0.048745 0.132594
polarizability: 2.02799010e+02 -4.45909535e+00 1.60373145e+02 1.62604147e+00 -9.69509096e-01 8.39217593e+01
1716.lowfreq: -11.1945 -0.0003 0.0001 0.0006 7.7951 8.8713 31.9191 53.6349 82.7065
frequency: 31.8886 53.6314 82.6927 92.7994 111.3992 159.7240 190.2238 195.5827 200.4798 224.4889 234.9017 249.3232 270.6605 290.6268 291.7041 337.5639 349.6865 382.4860 410.4139 423.0113 430.4356 469.0150 483.0108 509.2105 517.7555 525.2756 529.6745 564.9252 572.2231 593.6823 634.2792 654.6705 669.6585 693.0388 735.0933 787.8274 815.1356 891.0708 900.7459 951.7932 970.8876 1001.4822 1020.5047 1053.5045 1063.8516 1079.6617 1087.3328 1099.4642 1140.3578 1161.9632 1194.9844 1213.5800 1230.8090 1245.2864 1266.8952 1285.0705 1302.7345 1312.7820 1319.6875 1330.1360 1334.1420 1363.7387 1372.7207 1390.6210 1401.2194 1436.1439 1460.8744 1465.7851 1477.0271 1478.5337 1519.0284 1555.4435 1585.5949 1626.4502 1682.5987 2895.1996 2959.7073 2971.9527 2981.5891 2987.0825 3037.2764 3069.0318 3098.7560 3517.2726 3518.8132 3534.8474 3535.7542 3540.3829 3587.2852 3687.7639
redmass: 5.4311 4.3150 4.8752 5.5981 4.1635 3.5225 4.0749 4.9621 4.3346 1.5316 4.8927 1.2543 1.5732 2.0488 1.8855 3.1900 5.5737 1.7159 2.2599 3.4547 3.8797 2.9978 1.6471 1.3290 2.8752 1.2928 1.5893 2.2115 4.2920 4.3481 4.4147 3.0905 6.7492 4.8134 11.5198 3.6360 3.1607 3.1631 3.0600 2.7070 3.9919 2.0966 1.8617 2.6686 1.9995 1.9814 2.2720 2.2075 3.7520 2.7027 1.3006 1.2212 1.9015 1.6974 1.2986 2.0798 1.2734 1.7419 1.3014 1.5309 1.3292 1.6036 1.9089 1.2582 1.7893 2.2506 1.3900 1.2712 1.2138 1.1705 4.0052 9.1560 1.9333 1.7454 7.2861 1.0705 1.0816 1.0805 1.0521 1.0741 1.0905 1.0976 1.1000 1.0648 1.0766 1.0730 1.0683 1.0580 1.0666 1.1035
irintensity: 0.5413 7.8237 9.7834 1.5214 2.9951 5.3723 9.6516 4.7930 4.7893 0.3622 11.4254 96.9207 47.1381 48.5396 45.2756 16.1239 6.8922 12.9822 3.3775 26.8223 27.4544 29.4693 115.9890 68.3300 106.9086 38.4767 394.1757 21.7794 3.3785 70.9124 24.6790 4.9425 2.0681 10.2614 11.2278 9.4805 16.9357 23.4957 9.7774 38.6203 9.6483 11.0816 88.7475 31.0479 66.1050 20.9764 43.5661 3.5308 19.6070 26.7250 16.5711 10.2986 15.2444 45.8178 17.8715 54.7624 23.1199 38.0150 1.1873 192.0270 11.8618 32.3256 29.1404 30.7549 20.0746 72.2385 19.3879 32.4748 83.4765 11.1919 219.1585 445.4439 110.2346 475.8366 301.1290 100.5982 5.0647 10.3233 78.8370 60.5891 55.8060 38.3667 16.9098 37.9605 49.7912 105.2385 8.7495 57.5261 6.0837 37.2520
temp: 298.150 k
press: 1.00000 atm
elementType: 8 8 8 7 7 7 7 7 6 6 6 6 6 6 6 6 6 1 1 1 1 1 1 1 1 1 1 1 1 1 1 1
symmnumber: 1
zpe: 669701.9 jmol-1
zpe.correction: 0.255076 hartree
zpe.thermalcorrener: 0.272213 hartree
zpe.thermalcorrenthalpy: 0.273158 hartree
zpe.thermalcorrgfe: 0.210964 hartree
zpe.sumelectzpe: -850.082413 hartree
zpe.sumelectthermal: -850.065276 hartree
zpe.sumelectthermalent: -850.064331 hartree
zpe.sumelectthermalfe: -850.126525 hartree
dipole: -7.5300 -5.8081 0.2742
dipole: 9.5137
quadrupole: -92.8318 -95.5756 -104.0867
quadrupole: -36.9196 0.2325 -2.8971
quadrupole: 4.6663 1.9224 -6.5887 -36.9196 0.2325 -2.8971
hfenergy: -850.337489 hartree
pointgroup: C01 [X(C9H15N5O3)]
dipole: -2.9948304 -2.245058 -0.0224146 debye
polarizability: 202.6730257|-5.1350888|160.3203224|0.7370112|3.9426976|84.1005661 unknown
InChI: InChI=1S/C9H15N5O3/c1-3(15)6(16)4-2-11-5-7(12-4)13-9(10)14-8(5)17/h3-4,6,11-13,15-16H,2,10H2,1H3
charge 0 multiplicity 1
32 atoms
O  -2.888295 -1.831424 0.128406
O  -5.049413 -0.481442 -0.716308
O  3.07303 2.4252 0.109466
N  -0.35954 -0.941794 -0.080503
N  0.344825 1.77815 0.124407
N  1.988863 -1.524034 -0.083954
N  3.716081 0.144744 0.095421
N  4.279788 -2.134048 -0.069927
C  -1.409792 0.059527 0.196306
C  -2.713464 -0.473774 -0.418509
C  -0.97877 1.436383 -0.392068
C  -3.978422 0.366057 -0.126987
C  0.975718 -0.549535 -0.024973
C  1.341236 0.786808 0.060195
C  -4.246901 0.639994 1.360769
C  2.750972 1.187552 0.081291
C  3.328141 -1.11837 -0.004199
H  -1.543102 0.177898 1.291376
H  -2.596787 -0.538402 -1.521694
H  -1.006627 1.364284 -1.50502
H  -1.702406 2.211737 -0.081145
H  -0.653551 -1.913015 0.046322
H  -3.91975 1.320223 -0.690992
H  0.707173 2.734066 0.065546
H  -4.21774 -0.300045 1.93812
H  -5.238377 1.112297 1.49858
H  -3.496767 1.332891 1.78302
H  1.752829 -2.48125 -0.351022
H  -3.793057 -2.127077 -0.158972
H  -5.93603 -0.099479 -0.50134
H  5.246632 -1.815765 -0.047107
H  4.0736 -3.087159 0.221195
