program: Gaussian 09
title: 000126220
version: EM64L-G09RevD.01
frameworkgroup: C1[X(C10H14N4O5)]
method: RPBEPBE
basis: SDD
operation: Freq
keyword: #p
keyword: freq=noraman
keyword: PBEPBE/SDD
title: #p freq=noraman PBEPBE/SDD
converged: YES YES NO NO
title: Mulliken charges:
elementType: O O O O O N N N N C C C C C C C C C C H H H H H H H H H H H H H H
charge: -0.295473 -0.481976 -0.493010 -0.425354 -0.422546 -0.199803 -0.396767 -0.082471 0.019673 -0.024833 -0.164803 -0.199837 -0.079881 -0.324237 0.283324 -0.231812 0.012336 -0.309629 -0.259739 0.261408 0.296695 0.252059 0.264518 0.203176 0.221189 0.271851 0.393514 0.375345 0.229675 0.374492 0.359760 0.233950 0.339205
chargesum: 0.00000
title: Mulliken charges with hydrogens summed into heavy atoms:
elementType: O O O O O N N N N C C C C C C C C C C
charge: -0.295473 -0.088462 -0.117664 -0.065594 -0.083341 -0.199803 -0.022276 -0.082471 0.019673 0.236575 0.131892 0.052221 0.184638 0.100128 0.283324 0.040039 0.012336 -0.079953 -0.025789
polarizability: 1.90911500e+02 8.34933962e-01 1.54425533e+02 -6.99521954e+00 5.63291473e+00 9.81787967e+01
1716.lowfreq: -3.8792 -0.0009 -0.0006 -0.0002 4.2228 11.1936 22.0566 34.2684 55.1050
frequency: 21.7051 34.1959 55.0926 72.2808 89.3238 107.3928 123.2975 155.8537 168.9401 201.9386 240.7748 242.4544 250.3560 271.7172 294.5962 313.8958 328.5822 362.0909 391.7311 441.0792 444.4916 465.3460 492.0256 542.5874 555.2781 571.5731 591.7725 597.6059 622.9354 644.9223 706.6242 710.5839 741.0868 745.0257 790.7746 798.1664 829.6525 857.7892 871.2060 876.5921 903.0548 928.8398 956.1487 966.8982 973.6757 1005.4247 1040.3940 1048.4748 1055.6103 1072.7300 1076.6270 1098.9522 1152.7326 1168.7439 1178.3657 1185.3434 1201.2912 1217.4768 1241.2414 1247.7494 1258.2854 1272.4339 1284.7111 1297.9699 1310.4296 1321.4578 1336.5095 1345.5578 1362.1810 1364.5266 1368.2524 1382.5883 1385.2341 1398.0588 1414.6452 1457.4969 1535.9128 1583.5539 1613.7807 2953.7364 2982.0196 2995.3501 3018.3554 3040.3580 3067.8582 3071.4423 3129.1407 3263.5670 3384.6516 3452.8328 3534.3631 3545.7538 3615.0701
redmass: 6.3045 6.0075 6.4203 4.8166 3.4215 6.7807 6.5648 5.6566 5.5386 1.0958 1.5586 3.9697 4.3678 3.9937 4.8866 4.1222 5.5892 5.6353 5.2676 6.3753 1.2274 5.3167 3.4008 4.1980 1.4936 2.6020 5.8430 5.2304 4.2479 5.9653 4.2343 4.1288 1.2097 1.5623 5.7603 4.2480 4.2520 5.7889 3.1513 2.5997 3.6572 2.2876 3.0984 3.4657 3.5244 3.5181 2.7906 3.2457 3.5098 2.6775 3.3953 4.1962 1.3894 2.0609 1.2260 2.1702 1.2026 1.4152 2.0508 1.4083 1.3338 1.3183 1.4206 1.7399 1.3693 1.4347 1.2546 1.4403 1.4429 1.3330 2.7385 1.2758 1.4859 2.1213 2.6926 1.0886 4.0276 3.9583 8.1556 1.0674 1.0849 1.0859 1.0871 1.0863 1.0954 1.0887 1.0919 1.0979 1.0835 1.0645 1.0658 1.0656 1.0673
irintensity: 0.8197 1.7672 2.7796 1.6772 9.7604 3.6353 3.5349 0.5474 1.6957 178.0597 97.1544 27.0919 15.1626 5.2767 15.4110 7.6505 5.4585 4.8147 5.0014 8.4479 147.4751 6.8119 14.0926 0.9955 48.7659 44.4782 34.0472 15.0894 36.6716 16.4379 28.7428 25.3925 115.0012 20.8380 43.3700 22.4335 21.9297 34.5352 38.9054 38.1985 89.9342 36.6395 68.7115 41.8907 88.8102 96.2236 29.9977 72.7747 17.3857 22.1654 35.7104 58.1807 47.7214 6.8827 37.3914 74.7553 75.4694 43.6490 13.0341 34.2621 1.9354 6.7399 6.9977 6.7140 26.1690 22.4650 6.6995 43.3542 1.0031 3.3664 1.8149 43.2193 18.9704 68.0369 19.1570 5.0496 382.3097 9.6081 110.6389 46.7229 26.3571 64.8027 24.2630 17.3788 40.0540 13.9815 22.7487 1.0549 382.1015 61.8835 5.7562 9.6181 31.6332
temp: 298.150 k
press: 1.00000 atm
elementType: 8 8 8 8 8 7 7 7 7 6 6 6 6 6 6 6 6 6 6 1 1 1 1 1 1 1 1 1 1 1 1 1 1
symmnumber: 1
zpe: 662080.4 jmol-1
zpe.correction: 0.252173 hartree
zpe.thermalcorrener: 0.269919 hartree
zpe.thermalcorrenthalpy: 0.270863 hartree
zpe.thermalcorrgfe: 0.205433 hartree
zpe.sumelectzpe: -983.074494 hartree
zpe.sumelectthermal: -983.056748 hartree
zpe.sumelectthermalent: -983.055804 hartree
zpe.sumelectthermalfe: -983.121233 hartree
dipole: 9.9763 4.5543 -0.3954
dipole: 10.9738
quadrupole: -123.1857 -110.7948 -114.6650
quadrupole: 17.0272 7.6636 -1.0836
quadrupole: -6.9705 5.4204 1.5501 17.0272 7.6636 -1.0836
hfenergy: -983.3266666 hartree
pointgroup: C01 [X(C10H14N4O5)]
dipole: 3.8696322 1.9033544 -0.2082897 debye
polarizability: 190.5598385|2.0217183|154.4168632|-8.737173|5.8228694|98.5391282 unknown
InChI: InChI=1S/C10H14N4O5/c15-1-4-6(16)7(17)10(19-4)14-3-13-5-8(14)11-2-12-9(5)18/h2-4,6-7,9-11,15-18H,1H2
charge 0 multiplicity 1
33 atoms
O  2.214805 -0.732743 -0.929254
O  0.934518 2.526358 0.209086
O  3.39308 2.197794 -0.583475
O  3.75458 -2.621169 0.548252
O  -3.969565 -1.258629 1.390543
N  -0.14368 -0.446703 -0.715751
N  -1.669615 1.412406 0.07846
N  -1.736493 -2.073853 -0.901515
N  -4.020474 0.794233 0.213528
C  1.13387 0.258611 -0.865849
C  1.464105 1.180837 0.349764
C  3.01272 1.153782 0.384085
C  3.366562 -0.270385 -0.082003
C  3.538857 -1.277362 1.070153
C  -1.361757 0.110175 -0.306276
C  -0.438269 -1.782442 -1.085654
C  -2.323682 -0.894098 -0.412317
C  -3.733682 -0.65283 0.041314
C  -3.041213 1.661877 0.277541
H  1.13808 0.853065 -1.802322
H  1.03823 0.756363 1.273575
H  3.416313 1.38474 1.388436
H  4.25967 -0.293037 -0.732344
H  2.656851 -1.243949 1.74635
H  4.446922 -1.041939 1.652641
H  0.32957 -2.452805 -1.457413
H  1.60619 3.043131 -0.318011
H  4.364027 2.374569 -0.560852
H  -4.481918 -1.074496 -0.657977
H  -0.953264 2.150964 0.136003
H  2.992383 -2.842102 -0.047785
H  -3.283611 2.712421 0.478681
H  -3.92581 -2.244484 1.273487
