program: Gaussian 09
title: 000126215
version: EM64L-G09RevD.01
frameworkgroup: C1[X(C16H26O4)]
method: RPBEPBE
basis: SDD
operation: Freq
keyword: #pfreq=noraman
keyword: PBEPBE/SDD
title: #p freq=noraman PBEPBE/SDD
converged: YES YES NO NO
title: Mulliken charges:
elementType: O O O O C C C C C C C C C C C C C C C C H H H H H H H H H H H H H H H H H H H H H H H H H H
charge: -0.175831 -0.174468 -0.416434 -0.223072 -0.385035 -0.385447 -0.381941 -0.385807 -0.373057 -0.374511 -0.353199 -0.372197 -0.356831 -0.508743 -0.696559 0.127446 0.061768 -0.198460 -0.231416 0.158292 0.193894 0.193787 0.193491 0.193698 0.192065 0.191933 0.196119 0.196229 0.189764 0.189603 0.192944 0.192659 0.187610 0.187566 0.215681 0.218995 0.194793 0.194968 0.256392 0.261383 0.209623 0.215168 0.209603 0.304103 0.287044 0.386388
chargesum: 0.00000
title: Mulliken charges with hydrogens summed into heavy atoms:
elementType: O O O O C C C C C C C C C C C C C C C C
charge: -0.175831 -0.174468 -0.030046 -0.223072 0.002646 0.001742 0.002057 0.006540 0.006310 0.011092 0.021977 0.062479 0.032930 0.009033 -0.062164 0.127446 0.061768 0.105643 0.055628 0.158292
polarizability: 2.88027935e+02 4.08289728e+00 1.69833860e+02 -1.68589992e-01 -4.21228312e-01 1.23701042e+02
1716.lowfreq: -31.6913 -5.2920 -0.0017 0.0011 0.0015 2.7592 7.6618 13.6411 16.2815
frequency: -26.2095 8.7875 15.8218 22.1085 41.3074 43.8074 49.2320 51.0798 78.5989 85.4749 87.7584 117.1457 119.8260 121.9065 137.8905 138.7699 147.4359 149.5624 162.4503 199.0811 229.0028 244.9206 253.4000 285.2826 308.2436 380.6224 390.0858 402.5167 459.5884 475.3715 488.7683 535.6790 571.0790 587.4704 641.5548 694.8771 701.3864 718.6113 721.2207 727.0347 742.9365 772.2358 812.6120 815.8732 861.3796 886.9633 912.8349 928.1964 941.0326 952.5687 974.5047 985.1845 998.2570 1022.1905 1024.5977 1028.6366 1047.0640 1054.2945 1062.0426 1079.3370 1079.5843 1081.6994 1088.5422 1092.2602 1122.2827 1149.5969 1180.8367 1200.6465 1204.9989 1226.9689 1227.3610 1237.7216 1254.0901 1264.5959 1274.8710 1278.2859 1283.5019 1286.8587 1289.3945 1295.6590 1297.2427 1297.8465 1318.6807 1328.7583 1340.8350 1350.8916 1352.8904 1356.9601 1365.7449 1386.6200 1413.2938 1458.8878 1459.0751 1462.1975 1463.0970 1465.5260 1470.5248 1475.9854 1476.8552 1481.5688 1486.1183 1488.1342 1566.1822 1610.8878 1634.1784 1651.6183 2948.6238 2949.0237 2950.4407 2951.8276 2953.6701 2958.7451 2964.0369 2966.6109 2967.5623 2971.1484 2981.7494 2985.3683 2989.7879 2990.5034 2997.5802 3004.0327 3009.0345 3020.7799 3031.9449 3041.0613 3054.0872 3067.7241 3070.0899 3153.2418 3157.7521 3521.6926
redmass: 1.8956 4.7639 5.3410 5.4561 4.0712 4.3687 4.4490 2.2631 2.6609 1.8599 4.6775 2.3094 5.4330 1.8864 4.8188 5.9456 2.1081 2.0143 2.4489 4.2723 1.1151 6.4288 5.5293 6.3708 3.8552 3.5128 3.6092 3.4369 5.4820 3.2852 3.1362 5.1293 1.5798 5.7536 1.6420 2.4196 6.2718 1.0597 1.0777 1.1528 1.2387 1.3113 1.4059 5.9028 1.3391 1.9049 1.4296 1.7114 3.8467 4.8846 1.2372 4.8563 3.8823 1.1749 3.2039 1.0975 2.9976 2.2641 2.9109 2.1232 2.4236 2.2499 2.1648 1.4671 2.8703 2.1559 1.8864 1.5728 1.3019 1.4160 1.3989 1.3561 1.2805 1.3414 1.1737 1.0272 1.5016 1.0717 1.1115 1.4388 1.1138 1.1177 1.4910 2.1486 1.5552 1.6768 1.6471 1.6493 1.7795 1.2164 1.0993 1.0734 1.0725 1.0719 1.0633 1.0782 1.0835 1.0744 1.0527 1.0878 1.0904 1.0958 12.2245 9.2405 8.9344 6.3488 1.0584 1.0584 1.0590 1.0589 1.0594 1.0592 1.0587 1.0625 1.0584 1.0364 1.0962 1.0973 1.0602 1.0986 1.1007 1.0953 1.1028 1.1046 1.1049 1.1046 1.1032 1.1007 1.0993 1.0984 1.0863 1.0642
irintensity: 0.0198 0.0228 0.1749 1.0034 0.0047 1.5460 1.2506 0.1880 2.4045 0.0499 0.2958 1.4390 1.0391 0.0395 0.3945 2.0334 0.0787 0.1216 1.5656 4.0890 0.0091 1.0132 6.0795 10.0657 0.5511 3.1723 10.5234 7.4690 36.4381 7.4820 1.9724 15.6021 69.3787 36.1419 51.7224 69.4409 36.6561 17.2296 0.5966 1.4622 1.7592 0.4038 0.5403 4.5160 0.8288 4.7556 0.7297 0.9166 2.9913 30.1164 1.0948 2.1614 0.8108 0.8844 1.5260 50.6012 38.3946 359.7142 8.0608 0.1504 1.0182 0.4863 0.1992 0.2418 15.1626 5.0286 0.1732 0.5841 43.3161 29.9400 4.4695 3.8756 0.0829 28.3645 0.3649 0.2933 59.1304 0.1016 0.1272 0.4266 0.0662 0.1080 44.7446 193.7090 1.6555 0.5313 0.0421 0.3016 6.0097 11.1907 37.2861 0.0350 0.0241 0.2376 0.0189 1.3423 0.6361 4.7028 10.4340 1.3664 1.7910 39.5820 95.6809 57.1056 190.1995 5.9825 0.0261 0.3966 0.0038 1.7500 3.9875 1.0874 73.9277 19.1581 203.5792 37.2740 0.0724 0.2637 31.8145 1.0601 1.0939 1.4636 0.0377 4.1508 0.4642 181.3919 114.1375 99.0977 55.6101 2.3314 3.2897 56.1813
temp: 298.150 k
press: 1.00000 atm
elementType: 8 8 8 8 6 6 6 6 6 6 6 6 6 6 6 6 6 6 6 6 1 1 1 1 1 1 1 1 1 1 1 1 1 1 1 1 1 1 1 1 1 1 1 1 1 1
symmnumber: 1
zpe: 1021227.9 jmol-1
zpe.correction: 0.388965 hartree
zpe.thermalcorrener: 0.412831 hartree
zpe.thermalcorrenthalpy: 0.413775 hartree
zpe.thermalcorrgfe: 0.329672 hartree
zpe.sumelectzpe: -924.594423 hartree
zpe.sumelectthermal: -924.570558 hartree
zpe.sumelectthermalent: -924.569614 hartree
zpe.sumelectthermalfe: -924.653717 hartree
dipole: 0.4333 1.4024 0.0405
dipole: 1.4683
quadrupole: -109.0783 -136.7067 -119.7716
quadrupole: -8.0551 -0.1078 0.1200
quadrupole: 12.7739 -14.8545 2.0806 -8.0551 -0.1078 0.1200
hfenergy: -924.9833884 hartree
pointgroup: C01 [X(C16H26O4)]
dipole: 0.1632137 0.291077 0.471549 debye
polarizability: 287.9006565|2.7043405|138.0869166|4.9479251|21.4160327|155.575264 unknown
InChI: InChI=1S/C16H26O4/c1-2-3-4-5-6-7-8-9-10-11-14(17)15(18)12-13-16(19)20/h12-13,19H,2-11H2,1H3
charge 0 multiplicity 1
46 atoms
O  -3.174615 -0.750157 -1.326391
O  -4.388425 1.136142 1.43678
O  -9.280131 0.36298 0.325645
O  -8.287647 -0.865791 -1.38923
C  4.604789 -0.103659 -0.366771
C  3.319491 0.298531 0.391189
C  5.901669 0.272699 0.384653
C  2.023153 -0.090838 -0.354114
C  7.187596 -0.119872 -0.377579
C  0.738352 0.327333 0.395592
C  8.484462 0.249177 0.377613
C  -0.551886 -0.085586 -0.346293
C  9.770837 -0.140234 -0.386378
C  -1.822233 0.35941 0.399005
C  11.061082 0.22977 0.377104
C  -3.112308 -0.0593 -0.274021
C  -4.432295 0.40921 0.401178
C  -5.695617 -0.043566 -0.241317
C  -6.911502 0.313673 0.2627
C  -8.173976 -0.139426 -0.373986
H  4.606974 0.379774 -1.366149
H  4.593781 -1.198341 -0.551807
H  3.326688 1.394821 0.566963
H  3.322317 -0.176725 1.394538
H  5.902804 -0.217037 1.381022
H  5.909696 1.366278 0.57663
H  2.02616 0.373522 -1.362303
H  2.010877 -1.188603 -0.518321
H  7.189398 0.374477 -1.371692
H  7.177414 -1.212559 -0.574652
H  0.745595 1.427412 0.545888
H  0.743592 -0.124854 1.40966
H  8.485416 -0.247561 1.370573
H  8.495309 1.341393 0.57739
H  -0.553673 0.34686 -1.365857
H  -0.571237 -1.183966 -0.484362
H  9.758488 -1.2312 -0.587017
H  9.770172 0.357565 -1.377641
H  -1.840501 -0.036747 1.436999
H  -1.850239 1.460278 0.538269
H  11.113597 1.319632 0.561175
H  11.965672 -0.061394 -0.188126
H  11.098444 -0.277388 1.359802
H  -5.612517 -0.674257 -1.133846
H  -6.990196 0.946694 1.153978
H  -10.119031 0.052129 -0.111394
