program: Gaussian 09
title: 000126200
version: EM64L-G09RevD.01
frameworkgroup: C1[X(C13H10N4O3S)]
method: RPBEPBE
basis: SDD
operation: Freq
keyword: #p
keyword: freq=noraman
keyword: PBEPBE/SDD
title: #p freq=noraman PBEPBE/SDD
converged: YES YES NO NO
title: Mulliken charges:
elementType: S O O O N N N N C C C C C C C C C C C C C H H H H H H H H H H
charge: 0.235293 -0.218738 -0.265210 -0.269365 -0.117709 0.006327 -0.655198 -0.632684 0.167109 0.073168 0.506989 -0.397510 -0.117927 0.130616 -0.475796 0.444530 -0.597099 -0.565124 0.282594 -0.622784 0.112640 0.274034 0.214300 0.269746 0.269822 0.252096 0.301877 0.352462 0.322814 0.327295 0.391430
chargesum: 0.00000
title: Mulliken charges with hydrogens summed into heavy atoms:
elementType: S O O O N N N N C C C C C C C C C C C C C
charge: 0.235293 -0.218738 -0.265210 -0.269365 -0.117709 0.006327 0.020078 0.086041 0.167109 0.073168 0.506989 -0.123476 -0.117927 0.130616 -0.475796 0.444530 0.156770 -0.313028 0.282594 -0.320907 0.112640
polarizability: 3.28787582e+02 3.33066131e+00 2.58132832e+02 -5.96807683e-02 2.89358478e-02 7.75411765e+01
1716.lowfreq: -6.8883 0.0011 0.0011 0.0019 1.3446 2.9703 15.4917 46.4096 49.1906
frequency: 15.3422 46.4036 49.1903 76.3413 91.7086 98.8578 103.5781 154.6741 161.4490 175.0773 205.1855 215.4506 239.2424 243.6319 270.2328 332.9020 342.2215 360.0452 387.8804 396.1023 425.9037 431.8714 485.7572 502.8990 519.1550 531.6087 558.0698 568.4309 590.3108 597.7320 632.9443 635.2167 662.4188 664.8160 678.6609 692.6042 724.3181 741.5886 745.0957 748.1804 794.1787 796.8670 814.2797 819.3473 855.6853 902.1525 927.3258 951.7586 1040.4885 1065.4930 1070.7272 1084.0765 1111.3029 1120.9254 1196.1015 1216.4915 1261.2222 1266.2620 1305.7703 1338.1807 1352.4842 1371.7914 1409.9121 1415.9116 1442.6690 1450.0762 1461.8260 1481.9447 1500.3124 1507.4489 1532.6635 1548.9687 1575.6658 1591.2825 1597.6826 1636.0003 1645.7530 3018.0257 3121.1838 3127.2035 3150.1228 3226.9074 3249.9989 3454.5089 3481.3941 3652.9063 3667.4375
redmass: 8.1518 8.9836 7.2762 4.8565 4.1991 1.3580 3.9189 6.3768 6.5868 5.8217 6.7111 5.7217 4.3657 10.2084 4.7099 3.8362 6.8472 5.6847 8.7461 7.6638 5.3826 2.3925 7.3366 3.1268 6.8751 1.4735 8.4732 2.2544 4.5068 4.3403 7.5238 2.5570 1.4244 4.7658 2.1077 3.9811 6.4178 2.4863 7.2208 1.1859 1.6867 5.1670 2.8065 1.8500 2.4106 7.4292 7.4169 6.3534 1.9390 1.6994 1.8865 1.5312 2.3231 1.3340 1.5936 4.7079 2.4390 3.0231 5.6367 4.8357 4.7902 3.2940 8.3428 3.3561 2.0066 1.0397 2.8788 1.4113 5.0142 5.4166 4.6950 3.6368 1.4754 7.5967 2.0919 4.8167 4.2000 1.0329 1.1015 1.1039 1.0919 1.0984 1.0960 1.0508 1.0491 1.0997 1.0991
irintensity: 0.1762 0.6643 1.4317 7.1386 0.4526 5.3781 10.4889 0.0314 9.5884 0.0135 3.8275 0.0091 0.3991 3.6788 2.3489 1.7844 0.0308 1.1629 39.1404 11.6434 3.8494 40.0593 0.9029 5.3397 4.8454 82.2456 5.5504 56.1201 16.3671 4.8792 12.4966 33.3521 180.0622 5.4652 8.9589 5.5404 0.0156 116.1007 13.8023 87.7636 10.7489 21.8240 6.5745 51.2445 40.2873 26.9644 75.1288 1.8291 5.9481 0.4849 2.1766 2.2190 1.1925 1.5644 40.1567 145.6662 3.9334 72.0098 79.7187 99.7549 1.4051 24.2177 46.9860 19.4584 42.4009 15.6137 123.5886 0.2184 34.0144 45.2912 140.3325 360.5087 222.1536 8.1705 94.8853 303.1787 292.5897 23.1018 6.0212 13.1851 10.0663 1.2752 14.3812 91.2704 95.4536 92.6974 74.5414
temp: 298.150 k
press: 1.00000 atm
elementType: 16 8 8 8 7 7 7 7 6 6 6 6 6 6 6 6 6 6 6 6 6 1 1 1 1 1 1 1 1 1 1
symmnumber: 1
zpe: 572495.8 jmol-1
zpe.correction: 0.218052 hartree
zpe.thermalcorrener: 0.236748 hartree
zpe.thermalcorrenthalpy: 0.237692 hartree
zpe.thermalcorrgfe: 0.169768 hartree
zpe.sumelectzpe: -1342.678053 hartree
zpe.sumelectthermal: -1342.659357 hartree
zpe.sumelectthermalent: -1342.658413 hartree
zpe.sumelectthermalfe: -1342.726337 hartree
dipole: -4.6305 -0.1274 0.0044
dipole: 4.6323
quadrupole: -166.1213 -88.9982 -130.8624
quadrupole: -8.0275 -0.0058 -0.0032
quadrupole: -37.4606 39.6624 -2.2018 -8.0275 -0.0058 -0.0032
hfenergy: -1342.8961049 hartree
pointgroup: C01 [X(C13H10N4O3S1)]
dipole: -1.8221938 -0.0305962 0.0087672 debye
polarizability: 328.936417|-0.2003679|257.9651727|-1.3561474|-1.4411359|77.5600015 unknown
InChI: InChI=1S/C13H10N4O3S/c1-17-3-5(13-16-7(4-21-13)12(15)20)9-10(17)8(18)2-6(14)11(9)19/h2-4H,14-15H2,1H3
charge 0 multiplicity 1
31 atoms
S  2.306272 2.698887 -0.101444
O  0.195179 -2.148213 -0.051843
O  -4.764737 0.336309 -0.046118
O  5.741824 -0.570073 -0.097994
N  -2.247156 1.908004 -0.07474
N  2.13049 0.035285 -0.083993
N  -1.977595 -3.639569 -0.02726
N  3.883997 -2.008537 -0.080541
C  -1.045823 -0.029892 -0.063469
C  -2.353386 0.522794 -0.061199
C  -0.113473 1.089335 -0.078844
C  -0.904229 2.256655 -0.084988
C  -0.891721 -1.485275 -0.051509
C  -3.618862 -0.248393 -0.047085
C  1.335784 1.086188 -0.086393
C  -2.203782 -2.288798 -0.037451
C  -3.363284 2.874582 -0.078031
C  -3.458083 -1.691111 -0.035546
C  3.489901 0.352952 -0.092902
C  3.790178 1.706957 -0.102775
C  4.488149 -0.767994 -0.090754
H  -0.595264 3.300031 -0.096213
H  -2.943952 3.893255 -0.089487
H  -4.00135 2.715721 -0.960787
H  -3.992496 2.731974 0.813785
H  -4.37699 -2.28712 -0.025238
H  4.779193 2.15953 -0.110386
H  -1.000389 -3.945644 -0.030034
H  -2.736115 -4.316068 -0.017556
H  4.466907 -2.84327 -0.07764
H  2.859814 -2.069398 -0.074365
