program: Gaussian 09
title: 000126161
version: EM64L-G09RevD.01
frameworkgroup: C1[X(C15H21NO6P)]
method: RPBEPBE
basis: SDD
operation: Freq
keyword: #p
keyword: freq=noraman
keyword: PBEPBE/SDD
title: #p freq=noraman PBEPBE/SDD
converged: YES YES NO NO
title: Mulliken charges:
elementType: P O O O O O O N C C C C C C C C C C C C C C C H H H H H H H H H H H H H H H H H H H H H
charge: 1.381709 -0.526821 -0.526917 -0.672554 -0.301029 -0.509582 -0.189623 -0.123078 -0.343591 -0.549850 -0.555346 -0.535309 -0.279557 0.251682 0.388207 0.202410 0.402731 -0.468017 -0.348866 -0.407407 -0.455698 -0.797269 0.123506 0.287678 0.295801 0.272982 0.267322 0.272206 0.264675 0.251330 0.318085 0.284067 0.265670 0.265974 0.235677 0.283099 0.279814 0.265750 0.275830 0.270061 0.254120 0.246024 0.253893 0.430210
chargesum: 1.00000
title: Mulliken charges with hydrogens summed into heavy atoms:
elementType: P O O O O O O N C C C C C C C C C C C C C C C
charge: 1.381709 -0.526821 -0.526917 -0.242344 -0.301029 -0.509582 -0.189623 -0.123078 0.239888 0.262659 0.278744 0.280402 0.239219 0.251682 0.388207 0.202410 0.402731 -0.188203 -0.083116 -0.131577 -0.185636 -0.043232 0.123506
polarizability: 2.67968701e+02 2.64329041e+01 2.51441553e+02 3.82057367e+00 -2.37547965e+01 1.44639742e+02
1716.lowfreq: -8.0533 -5.8078 0.0012 0.0012 0.0014 6.9626 13.3858 17.9244 30.7795
frequency: 13.1278 17.4459 30.7003 48.1756 55.9797 71.4109 83.7539 97.3100 103.8177 130.2037 167.7000 170.4042 171.7668 196.4030 198.2416 204.6874 217.7128 235.0172 246.0776 259.9977 271.1668 273.8140 292.9809 306.4850 315.3999 337.5246 343.4611 353.3230 392.5380 410.9349 427.9414 433.2947 439.7123 459.2488 472.3235 493.8649 511.0311 542.3344 556.0244 579.0074 621.9397 650.9256 666.4331 668.2250 714.6621 733.8161 737.7624 745.3346 770.0038 795.8538 813.2734 829.7113 864.1337 879.5130 891.1666 917.5267 944.9416 959.4260 966.9928 983.9409 996.1565 1017.0923 1044.5303 1045.3581 1053.4564 1053.9808 1058.0289 1096.2716 1113.8372 1114.5869 1130.4015 1132.5129 1153.4185 1184.2570 1214.5893 1224.5211 1245.0683 1250.9869 1257.1095 1268.4439 1311.7429 1337.3389 1377.3592 1382.3961 1392.7065 1402.4930 1419.9792 1424.9695 1428.4382 1451.8163 1455.9788 1461.0640 1463.9201 1465.7826 1468.3800 1474.5088 1484.5542 1487.7331 1491.7279 1495.2693 1499.3414 1556.1006 1605.6517 1614.2551 1696.6325 2985.9135 2993.8967 3018.8913 3025.0417 3027.7235 3043.4497 3062.2881 3075.5119 3111.6255 3118.2490 3134.0538 3141.8726 3144.2389 3147.5804 3149.4880 3150.9811 3162.8059 3178.1303 3189.4446 3197.8388 3602.4710
redmass: 4.0990 4.9868 4.1682 4.3866 4.8987 5.5469 4.2697 4.4987 5.2694 2.5052 1.6013 1.6280 1.7964 3.8575 4.1096 1.8670 2.2091 5.9665 3.3765 1.0842 1.2251 2.4708 3.5881 4.3157 5.1136 6.0802 2.4331 3.4878 4.9995 5.3036 6.1119 2.3718 4.8099 4.2954 3.3466 3.1664 6.5189 4.5010 4.7260 7.2037 4.2620 7.7964 6.1674 4.4799 7.0607 6.7466 3.2765 3.3819 5.8446 10.1722 1.4659 1.4627 1.5896 1.3795 3.0765 2.7844 2.7724 3.8613 1.3584 5.5471 1.8278 1.2676 1.2011 1.5861 1.5995 3.7122 2.0752 9.9983 1.8709 1.7980 2.0104 1.5578 1.8301 1.2591 1.8257 3.2765 1.3904 1.7121 1.9044 1.4322 1.2604 1.2544 2.4047 5.5610 1.2711 1.3165 4.8273 1.1498 1.1473 1.0802 1.0518 1.0933 1.0528 1.0454 1.1114 1.0890 1.0792 1.1906 1.4375 1.4606 1.0786 7.0522 7.4005 7.2701 10.6542 1.0389 1.0605 1.0332 1.0320 1.0332 1.0594 1.0967 1.1040 1.0984 1.1080 1.1062 1.1060 1.1051 1.1052 1.1060 1.1051 1.0895 1.0923 1.0963 1.0910 1.0670
irintensity: 3.3989 5.7590 0.7022 8.9446 1.0298 0.5572 2.1546 2.3678 1.1599 7.7866 11.3301 3.0725 73.2717 4.4147 9.5128 1.0764 8.0241 0.6167 32.5792 1.4558 8.0032 20.2014 5.1968 28.7976 3.5019 17.7771 1.8098 9.8646 18.8300 21.2139 21.9100 2.0300 18.6054 13.1448 10.9412 5.1344 10.6846 15.6439 17.5452 50.6399 2.2902 94.9082 8.0321 8.3875 119.6992 136.0037 56.2824 1.3985 132.5659 106.9354 8.0482 19.3854 36.5265 39.8927 41.6012 15.1927 41.7633 173.8766 1.9814 110.5146 41.1481 91.8711 0.8801 7.9746 1.7201 45.8058 5.0652 154.5414 69.9924 35.8899 16.3569 6.5080 33.7577 1.3676 2.6987 33.9840 4.5965 71.5034 0.2204 28.0490 4.1291 2.6903 117.9012 12.8286 4.6626 52.1613 12.7398 14.7813 22.3136 0.9294 1.0494 4.2062 3.1093 20.1534 12.5851 4.6035 16.2143 47.4996 59.0885 14.1522 75.0809 8.5562 58.9127 253.1664 509.6308 3.7376 23.1543 6.0080 2.5238 3.6786 2.0586 6.9392 10.2209 14.4400 6.7508 3.3259 1.0030 1.2395 7.8242 0.7551 11.0529 2.3382 0.3035 0.1080 0.2229 180.0532
temp: 298.150 k
press: 1.00000 atm
elementType: 15 8 8 8 8 8 8 7 6 6 6 6 6 6 6 6 6 6 6 6 6 6 6 1 1 1 1 1 1 1 1 1 1 1 1 1 1 1 1 1 1 1 1 1
symmnumber: 1
zpe: 909485.9 jmol-1
zpe.correction: 0.346405 hartree
zpe.thermalcorrener: 0.371273 hartree
zpe.thermalcorrenthalpy: 0.372218 hartree
zpe.thermalcorrgfe: 0.290152 hartree
zpe.sumelectzpe: -1429.509113 hartree
zpe.sumelectthermal: -1429.484245 hartree
zpe.sumelectthermalent: -1429.483301 hartree
zpe.sumelectthermalfe: -1429.565366 hartree
dipole: -5.9518 7.5026 7.0599
dipole: 11.8977
quadrupole: -81.3373 -92.8636 -143.8999
quadrupole: -39.8419 -3.6583 -1.6371
quadrupole: 24.6963 13.1700 -37.8663 -39.8419 -3.6583 -1.6371
hfenergy: -1429.8555181 hartree
pointgroup: C01 [X(C15H21N1O6P1)]
dipole: 3.6550575 2.1886092 -1.9394569 debye
polarizability: 241.6159072|-31.8699576|266.3738574|28.7188556|23.8421625|156.0602317 unknown
InChI: InChI=1S/C15H21NO6P/c1-11-9-15(17)21-14-10-12(5-6-13(11)14)22-23(18,19)20-8-7-16(2,3)4/h5-6,9-10,18H,7-8H2,1-4H3
charge 1 multiplicity 1
44 atoms
P  2.000035 -3.023004 0.454847
O  2.6568 -1.497284 0.958084
O  0.903314 -2.653053 -0.863224
O  3.304772 -3.585041 -0.486708
O  -1.020424 1.577221 0.434741
O  1.452388 -3.86864 1.661726
O  -1.719801 3.729281 0.861983
N  3.465898 2.07808 0.181199
C  3.35208 0.727817 0.921233
C  4.651596 2.06367 -0.78133
C  2.174938 2.401206 -0.580442
C  3.685205 3.166497 1.237959
C  3.245091 -0.5225 0.021032
C  -2.353987 0.079699 -1.008065
C  -0.205662 -1.769153 -0.803821
C  -1.202482 0.354249 -0.21629
C  -3.413379 1.089107 -1.067161
C  -0.153167 -0.56997 -0.071066
C  -2.38877 -1.172786 -1.689157
C  -1.325992 -2.088585 -1.609611
C  -3.230571 2.294591 -0.410141
C  -4.681445 0.810274 -1.83819
C  -2.027108 2.649763 0.326525
H  4.231496 0.644514 1.580945
H  2.45043 0.790895 1.552304
H  4.472645 1.321435 -1.573174
H  4.757023 3.062132 -1.232275
H  5.565764 1.806913 -0.224367
H  2.269703 3.410007 -1.010806
H  2.030569 1.669454 -1.388163
H  1.316174 2.366792 0.109415
H  2.830629 3.16773 1.931369
H  4.616347 2.956978 1.786096
H  3.756009 4.142911 0.735311
H  2.576955 -0.37042 -0.849112
H  4.223911 -0.893059 -0.327464
H  0.6583 -0.349952 0.623862
H  -3.259338 -1.427783 -2.300506
H  -1.343063 -3.035308 -2.15475
H  -3.998898 3.071852 -0.438048
H  -5.196128 -0.086257 -1.444906
H  -4.467338 0.619184 -2.906567
H  -5.381721 1.657734 -1.778945
H  3.324903 -4.551592 -0.703643
