program: Gaussian 09
title: 000126062
version: EM64L-G09RevD.01
frameworkgroup: C1[X(C13H17BrN2O)]
method: RPBEPBE
basis: SDD
operation: Freq
keyword: #p
keyword: freq=noraman
keyword: PBEPBE/SDD
title: #p freq=noraman PBEPBE/SDD
converged: YES YES NO NO
title: Mulliken charges:
elementType: Br O N N C C C C C C C C C C C C C H H H H H H H H H H H H H H H H H
charge: 0.018284 -0.287471 -0.414360 -0.572048 -0.044412 -0.164931 -0.467199 -0.415026 -0.411903 -0.405175 0.159802 0.271984 -0.346440 -0.346207 -0.185765 -0.196310 -0.203726 0.256421 0.267857 0.198240 0.221491 0.192122 0.228798 0.215488 0.178216 0.210426 0.196051 0.302078 0.275760 0.256743 0.282771 0.220572 0.255406 0.252464
chargesum: 0.00000
title: Mulliken charges with hydrogens summed into heavy atoms:
elementType: Br O N N C C C C C C C C C C C C C
charge: 0.018284 -0.287471 -0.112282 -0.039546 0.212010 0.102926 -0.047468 0.005894 -0.018199 0.001302 0.159802 0.271984 -0.063669 -0.125635 0.069641 0.056153 -0.203726
polarizability: 2.69653872e+02 7.82970757e+00 1.57534274e+02 -1.10962456e+01 8.59997013e+00 1.04789654e+02
1716.lowfreq: -23.9701 -0.0003 0.0004 0.0005 1.0640 7.0600 25.7257 29.7982 54.2983
frequency: 23.0460 29.7042 54.2468 63.0051 84.6802 120.8692 152.6529 189.9775 202.0417 238.4220 246.5143 260.8556 266.4930 297.6640 352.7183 368.4810 404.3750 415.9097 457.6453 462.2220 470.3470 497.2215 526.6738 543.5319 571.4143 622.0315 646.9215 677.6617 687.8837 740.1032 765.5887 795.5963 824.2776 824.7019 850.0846 854.3849 861.5527 899.4882 952.6373 972.4249 980.9855 990.0338 995.5145 1019.4598 1053.0151 1060.1296 1061.7639 1088.0272 1108.5415 1117.3744 1119.8397 1154.2938 1159.7810 1188.4382 1192.6256 1244.7075 1249.5313 1268.6930 1276.0959 1294.7493 1323.5103 1329.7252 1333.1448 1341.6821 1348.0835 1352.4835 1364.0556 1388.3786 1391.2182 1452.0664 1457.5371 1462.8424 1474.5546 1478.7866 1489.7227 1557.4837 1592.0218 1596.1256 1633.1289 2948.4545 2969.3716 2979.9293 2980.5339 3021.8372 3027.5602 3031.0348 3033.7430 3040.9908 3058.4050 3129.1633 3155.9081 3169.8614 3176.0209 3472.9859 3552.5471 3601.3490
redmass: 3.7561 6.2016 4.6764 4.7499 7.0336 4.7154 3.5251 5.2260 4.4601 1.8555 1.6193 3.5343 4.9706 3.5107 3.1463 2.2163 2.7829 2.6246 2.5357 2.2962 4.4364 3.4523 1.5448 1.3843 3.2419 6.8991 2.1676 4.5575 5.9948 3.4222 3.5379 1.6416 3.6785 1.4214 2.5505 1.4963 1.9888 1.8981 1.3858 1.9993 2.5193 1.4288 4.1511 1.8450 2.0378 1.8248 2.2429 1.7359 1.4313 1.1323 2.1190 2.3970 2.0150 1.1452 1.8054 1.4413 1.4542 1.2730 1.6871 1.2679 1.5324 1.3995 1.3341 1.4479 1.3876 1.5061 4.8119 3.8372 1.4389 1.7722 1.1087 1.1178 1.2417 1.2896 1.5199 7.7715 6.2631 7.4569 1.0965 1.0678 1.0640 1.0641 1.0620 1.0852 1.0893 1.0930 1.0951 1.1009 1.0983 1.0890 1.0888 1.0952 1.0971 1.0441 1.0769 1.0983
irintensity: 0.2959 0.2822 0.2244 4.4263 4.7765 2.4984 0.4202 3.2392 0.5866 20.3569 33.0200 3.9198 2.3694 5.4843 9.5335 3.0114 4.4004 23.1986 10.6428 25.9740 25.9312 3.6202 98.6270 195.9121 85.8371 1.2555 1.0517 16.5581 10.4349 23.8712 3.1332 1.9302 19.9877 15.6084 5.2165 30.3485 11.9026 39.1754 0.7716 4.8740 0.8675 8.2041 46.8270 21.1566 5.3087 1.1931 27.9802 2.9766 18.1049 8.7680 4.4559 3.6542 5.0720 5.5642 20.7608 17.8494 21.5053 1.9345 11.1781 0.7682 18.0247 16.1687 6.6516 1.5578 1.4764 9.8103 0.5875 5.9862 10.7776 327.2870 27.2258 16.9513 14.4451 51.5834 81.8106 62.5076 90.8423 61.7294 52.8394 33.1517 36.9996 38.7471 17.1927 17.7370 85.0386 30.8582 29.2839 59.9092 49.4939 14.3398 0.2679 5.9705 2.6942 1.9240 18.4428 1.8343
temp: 298.150 k
press: 1.00000 atm
elementType: 35 8 7 7 6 6 6 6 6 6 6 6 6 6 6 6 6 1 1 1 1 1 1 1 1 1 1 1 1 1 1 1 1 1
symmnumber: 1
zpe: 733405.9 jmol-1
zpe.correction: 0.279340 hartree
zpe.thermalcorrener: 0.295886 hartree
zpe.thermalcorrenthalpy: 0.296830 hartree
zpe.thermalcorrgfe: 0.232973 hartree
zpe.sumelectzpe: -702.511317 hartree
zpe.sumelectthermal: -702.494771 hartree
zpe.sumelectthermalent: -702.493826 hartree
zpe.sumelectthermalfe: -702.557683 hartree
dipole: 2.1630 -3.5041 -0.8491
dipole: 4.2045
quadrupole: -108.0670 -111.2131 -114.6448
quadrupole: -8.1446 -7.7169 2.9086
quadrupole: 3.2413 0.0952 -3.3365 -8.1446 -7.7169 2.9086
hfenergy: -702.7906568 hartree
pointgroup: C01 [X(C13H17Br1N2O1)]
dipole: -0.9281591 -1.3047606 0.415273 debye
polarizability: 266.8534923|-16.2480063|158.5828837|-17.754827|-8.917826|106.5414243 unknown
InChI: InChI=1S/C13H17BrN2O/c14-10-7-5-9(6-8-10)13(17)16-12-4-2-1-3-11(12)15/h5-8,11-12,16H,1-4,15H2
charge 0 multiplicity 1
34 atoms
Br 6.105362 -1.012636 -0.526844
O  -0.053309 2.169294 0.415981
N  -0.822593 -0.02084 0.505271
N  -4.177141 1.523894 -0.468692
C  -2.231166 0.3814 0.71183
C  -2.915844 0.784273 -0.651762
C  -3.013004 -0.744842 1.428522
C  -3.141019 -0.469705 -1.533507
C  -3.250895 -1.981518 0.524523
C  -3.938737 -1.577874 -0.802388
C  0.18557 0.917308 0.375542
C  1.586577 0.391492 0.178077
C  2.549475 1.293241 -0.341129
C  1.990901 -0.928487 0.506842
C  3.882826 0.889191 -0.556005
C  3.323764 -1.349087 0.30305
C  4.252828 -0.434194 -0.23444
H  -2.202623 1.289273 1.343274
H  -2.216897 1.466302 -1.169373
H  -3.995611 -0.334009 1.735096
H  -2.487495 -1.028952 2.360452
H  -2.154647 -0.876111 -1.836638
H  -3.664541 -0.157041 -2.454573
H  -3.86126 -2.72762 1.068183
H  -2.286732 -2.485615 0.294986
H  -4.045902 -2.460568 -1.461288
H  -4.969369 -1.225893 -0.589506
H  -0.619077 -1.009792 0.356238
H  -4.069342 2.46439 -0.079821
H  -4.940975 0.999599 -0.034261
H  2.229808 2.316332 -0.563338
H  1.290159 -1.638635 0.961556
H  4.617772 1.589039 -0.96323
H  3.633036 -2.364209 0.56727
