program: Gaussian 09
title: 000126065
version: EM64L-G09RevD.01
frameworkgroup: C1[X(C14H11INO3P)]
method: RPBEPBE
basis: SDD
operation: Freq
keyword: #p
keyword: freq=noraman
keyword: PBEPBE/SDD
title: #p freq=noraman PBEPBE/SDD
converged: YES YES NO NO
title: Mulliken charges:
elementType: I P O O O N C C C C C C C C C C C C C C H H H H H H H H H H H
charge: 0.072196 1.240863 -0.515122 -0.664475 -0.606018 -0.413186 0.148185 0.260913 0.183873 -0.300969 -0.306385 -0.156118 -0.320702 -0.360821 -0.141893 -0.289667 -0.242031 -0.201904 -0.208611 -0.215923 0.307459 0.312860 0.268319 0.236890 0.244260 0.280390 0.271741 0.239497 0.240162 0.237692 0.398526
chargesum: 0.00000
title: Mulliken charges with hydrogens summed into heavy atoms:
elementType: I P O O O N C C C C C C C C C C C C C C
charge: 0.072196 1.240863 -0.515122 -0.265949 -0.606018 -0.100326 0.148185 0.260913 0.183873 0.006490 -0.038066 -0.156118 -0.083812 -0.360821 0.102367 -0.009277 0.029710 0.037593 0.031551 0.021769
polarizability: 2.45939400e+02 3.09544410e+01 2.32436876e+02 -3.96609533e+00 -1.91985369e+01 1.56203483e+02
1716.lowfreq: -4.2626 -1.0829 -0.0009 0.0007 0.0013 5.4558 12.0389 18.6398 36.3536
frequency: 11.4363 18.5834 36.2640 61.8036 81.9253 100.8615 123.6479 136.8730 157.9002 186.0390 217.3392 224.1121 228.4188 254.0166 281.7243 315.0527 345.9265 351.8081 377.3863 397.6601 416.2360 432.4229 474.4130 502.4471 504.7127 565.9840 573.6659 578.9899 610.2103 625.2738 642.1735 683.2988 698.5725 729.8855 744.2655 754.3602 767.2245 782.1957 792.8954 812.2784 860.4156 860.5187 886.3218 935.9800 939.2212 986.1715 986.7038 1007.9367 1013.5322 1029.0584 1035.3681 1037.9577 1062.2408 1084.6434 1093.3061 1104.6628 1146.3564 1177.6195 1191.6867 1231.6965 1241.3937 1278.2259 1299.5426 1316.4550 1384.8595 1385.2497 1413.1432 1430.9615 1450.7455 1454.9120 1467.2698 1538.6428 1574.5210 1590.0119 1596.5343 1622.3545 3135.4863 3140.6938 3145.6949 3154.9986 3165.5918 3172.0813 3175.1358 3175.6652 3251.1103 3596.9681 3616.5061
redmass: 8.0609 6.4915 3.8451 9.5237 6.2022 6.0443 8.5000 6.0152 3.7352 2.8915 5.8755 7.4890 8.3767 7.2895 5.7244 2.2683 7.1691 5.1009 6.9156 2.8078 2.8903 8.4702 4.3793 2.4981 1.5538 7.0262 3.6322 5.0254 6.4802 4.6015 8.2857 7.2585 2.1009 6.6272 4.0437 4.7808 1.9409 6.2349 1.5122 1.3763 4.2510 1.3448 1.4356 1.3341 1.3608 3.6274 1.6160 1.3337 2.3630 1.4937 4.3619 2.2557 5.9722 1.6884 1.5795 2.9215 1.3333 1.0558 1.1271 2.8022 1.4369 2.1810 2.2857 1.3013 9.1109 7.6458 2.0955 2.1345 4.2049 5.0084 2.0446 6.0131 6.8895 6.1516 5.8185 7.3798 1.0858 1.0896 1.0889 1.0929 1.0971 1.0947 1.0943 1.1011 1.0996 1.0658 1.0811
irintensity: 0.5690 1.4599 0.0960 0.6311 0.0155 3.6519 3.7104 16.5988 9.7958 22.1169 4.0499 0.4447 8.6038 13.7642 8.6984 45.8510 18.7005 26.5974 53.7604 0.8075 10.5530 51.0726 25.0897 35.7214 145.4708 72.0344 18.8766 11.0869 0.7080 10.0213 17.8965 32.3084 58.8872 237.9810 16.3354 108.3102 1.7085 67.6824 78.9530 22.9146 34.7128 3.0887 17.3812 0.5921 0.8733 5.5564 1.6076 0.4460 63.8478 60.1197 43.6632 38.2040 60.6627 1.0335 65.5599 50.9608 8.8327 0.1172 3.8451 100.0177 1.3164 77.7941 15.9353 3.7295 4.0214 11.9019 19.5719 21.5232 73.0070 26.5233 6.0766 58.7620 12.9281 0.0707 1.7805 3.5923 0.8232 7.4467 4.9745 6.4357 13.0182 7.7313 1.8882 16.0680 6.2666 73.1377 77.9561
temp: 298.150 k
press: 1.00000 atm
elementType: 53 15 8 8 8 7 6 6 6 6 6 6 6 6 6 6 6 6 6 6 1 1 1 1 1 1 1 1 1 1 1
symmnumber: 1
zpe: 574485.3 jmol-1
zpe.correction: 0.218810 hartree
zpe.thermalcorrener: 0.237366 hartree
zpe.thermalcorrenthalpy: 0.238310 hartree
zpe.thermalcorrgfe: 0.168133 hartree
zpe.sumelectzpe: -1171.839118 hartree
zpe.sumelectthermal: -1171.820561 hartree
zpe.sumelectthermalent: -1171.819617 hartree
zpe.sumelectthermalfe: -1171.889794 hartree
dipole: 0.8486 0.3911 -2.4862
dipole: 2.6560
quadrupole: -151.5982 -114.5988 -125.5806
quadrupole: -13.1055 -3.6140 -5.7938
quadrupole: -21.0056 15.9937 5.0119 -13.1055 -3.6140 -5.7938
hfenergy: -1172.0579275 hartree
pointgroup: C01 [X(C14H11I1N1O3P1)]
dipole: -0.3443204 -0.9028675 0.3977236 debye
polarizability: 221.7138102|-13.5308534|154.7085027|-27.2402087|-2.2773631|258.1574462 unknown
InChI: InChI=1S/C14H11INO3P/c15-10-6-7-13-12(8-10)14(9-16-13)19-20(17,18)11-4-2-1-3-5-11/h1-9,16-17H
charge 0 multiplicity 1
31 atoms
I  4.205767 -0.487749 -3.292929
P  -1.932726 1.3615 0.898783
O  -0.196131 1.448668 0.537283
O  -2.303218 2.915541 0.266012
O  -2.226711 1.055489 2.432883
N  1.85276 -0.773132 2.570798
C  1.822176 -0.031994 0.405942
C  2.530427 -0.856262 1.350706
C  0.707191 0.5405 1.123519
C  0.74642 0.081937 2.441652
C  2.288921 0.081551 -0.929127
C  -2.758931 0.25317 -0.309209
C  3.692337 -1.570103 0.984139
C  3.445456 -0.634771 -1.275475
C  4.148817 -1.4542 -0.34438
C  -3.391565 -0.907644 0.193595
C  -2.74492 0.546247 -1.692657
C  -4.017839 -1.793157 -0.71075
C  -3.376499 -0.345325 -2.586246
C  -4.0088 -1.513459 -2.097082
H  0.065703 0.293431 3.262336
H  2.113239 -1.257181 3.426597
H  1.760033 0.710455 -1.649405
H  4.235681 -2.197471 1.698802
H  5.04661 -1.993087 -0.659057
H  -3.397111 -1.101529 1.271707
H  -2.262713 1.457927 -2.058249
H  -4.511838 -2.694958 -0.33454
H  -3.375702 -0.129737 -3.659688
H  -4.495446 -2.202947 -2.795675
H  -1.750289 3.648586 0.638417
