program: Gaussian 09
title: 000126087
version: EM64L-G09RevD.01
frameworkgroup: C1[X(C22H18O7)]
method: RPBEPBE
basis: SDD
operation: Freq
keyword: #pfreq=noraman
keyword: PBEPBE/SDD
title: #p freq=noraman PBEPBE/SDD
converged: YES YES NO NO
title: Mulliken charges:
elementType: O O O O O O O C C C C C C C C C C C C C C C C C C C C C C H H H H H H H H H H H H H H H H H H
charge: -0.444524 -0.410275 -0.268075 -0.296569 -0.189807 -0.243320 -0.372386 -0.288123 0.164115 -0.633372 0.370164 0.356465 0.035981 -0.054536 0.024700 0.328182 -0.610623 -0.574881 0.038792 -0.307500 0.155719 0.326112 0.085723 -0.679428 0.182975 -0.423481 -0.414200 -0.203206 -0.500954 0.258343 0.257195 0.247965 0.294956 0.215003 0.281877 0.361712 0.234148 0.228539 0.221701 0.390257 0.299625 0.226480 0.242767 0.362490 0.245299 0.240639 0.237337
chargesum: 0.00000
title: Mulliken charges with hydrogens summed into heavy atoms:
elementType: O O O O O O O C C C C C C C C C C C C C C C C C C C C C C
charge: -0.082812 -0.020018 -0.268075 -0.296569 -0.189807 -0.243320 -0.009896 -0.029780 0.164115 -0.128212 0.370164 0.356465 0.035981 -0.054536 0.024700 0.328182 -0.315667 -0.078001 0.038792 -0.307500 0.155719 0.326112 0.085723 0.004959 0.182975 -0.123855 -0.187720 0.039561 0.222321
polarizability: 5.01635750e+02 2.64598989e+01 3.01628259e+02 1.46860645e+01 -4.36140090e+00 1.36807616e+02
1716.lowfreq: -6.5406 0.0000 0.0008 0.0008 1.0723 7.5263 23.9944 29.0598 45.1726
frequency: 23.9658 28.9074 45.1706 48.9396 61.1129 65.3481 71.1128 76.4254 92.0023 97.6985 127.7722 142.0938 162.0666 186.0043 192.8339 203.1471 204.2002 218.0217 245.1874 253.8910 284.5011 286.9835 312.5995 327.4242 332.5549 344.1200 356.1061 376.0723 378.8378 413.7951 424.8576 430.4142 439.2554 452.8892 455.9917 460.1502 494.1981 515.3344 529.3017 543.7355 573.5825 587.3443 589.1396 620.8238 641.8940 676.6407 690.8894 700.8272 723.4877 736.1220 753.5802 760.0079 780.8482 795.8743 804.3200 821.8729 829.1355 842.9707 854.2478 896.7099 911.1392 914.9764 941.3425 954.8502 966.0079 975.0882 996.3687 1003.0791 1004.1266 1037.0194 1050.6261 1058.4960 1074.7369 1085.8392 1107.5957 1113.1165 1147.4105 1161.9544 1179.6950 1182.5232 1192.4554 1199.4686 1217.0752 1227.9618 1236.8087 1253.5427 1262.9956 1279.1156 1293.2735 1310.0775 1315.7038 1331.0585 1353.3034 1366.0422 1368.7997 1391.8421 1397.1729 1407.9345 1420.3795 1422.0834 1424.8361 1442.7818 1451.4392 1458.3227 1462.4423 1471.4258 1471.8939 1479.9946 1495.1296 1536.8420 1554.1565 1556.9453 1591.2806 1596.9687 1604.7511 1610.7100 1629.2345 2554.4779 2962.3195 2985.6946 2992.2751 3004.9318 3017.1507 3046.3019 3077.5999 3088.3877 3103.9585 3106.4298 3116.3536 3151.9427 3154.2195 3174.3636 3188.3136 3534.0407 3553.0915
redmass: 4.9843 6.1238 5.7939 4.0241 2.9895 4.0683 5.1104 4.3914 1.5508 2.9311 9.6716 4.6121 6.0747 5.2085 4.3904 5.2290 1.3899 3.5115 4.5803 3.0342 5.2635 6.2800 4.2014 3.7342 5.4415 2.8647 4.4935 2.7256 2.3448 3.9100 1.2430 7.5228 5.0045 8.9822 3.9810 4.6092 6.0133 4.9144 7.9518 4.8377 5.9047 4.8653 5.3357 7.0177 5.5812 5.3957 5.3945 5.5625 5.5530 6.5205 5.5672 6.3495 2.3710 2.1819 1.6425 2.9326 6.7002 4.7187 3.5778 4.3653 3.1143 1.6586 1.8463 3.0864 3.4377 3.7826 1.3786 3.3850 1.0848 3.4341 2.0717 4.1210 2.0473 1.8064 2.9676 1.2920 1.4617 1.4805 1.4186 1.2469 2.0871 2.4764 1.3700 1.5211 2.6007 2.0409 2.0152 1.8731 3.2205 1.4090 2.3530 4.4012 1.9321 1.7612 3.2079 1.2240 7.2558 3.7166 1.2154 1.1514 3.3639 3.8514 1.0548 4.0572 1.0779 2.9529 1.0871 1.0453 1.1204 6.2563 6.1362 4.0855 5.8782 5.4978 7.4879 7.9568 6.3708 1.0739 1.0666 1.0346 1.0677 1.0296 1.0853 1.0922 1.0986 1.1000 1.0968 1.1045 1.0896 1.1047 1.0913 1.0974 1.0909 1.0657 1.0661
irintensity: 1.1389 0.4211 2.8850 2.3929 1.4832 1.2375 0.1852 0.4272 0.4180 1.9123 0.7159 2.4030 1.6810 0.7592 0.2945 3.0050 0.3014 2.8226 7.3779 0.6656 3.0371 6.8976 4.2828 34.2349 5.2904 22.5141 34.5190 61.2206 26.6908 38.9188 109.7260 24.6273 7.5233 1.1280 5.6185 3.1691 9.9602 11.2384 2.6610 5.2544 8.0432 3.0991 8.6017 22.7324 3.1627 7.1263 3.0000 19.9117 0.6993 3.4062 3.6415 17.5357 45.9685 20.5204 7.8365 9.1532 14.5025 31.6630 2.5134 23.9018 30.4015 4.4582 12.2017 45.2622 22.0954 35.4798 2.6458 60.5864 126.4863 16.7520 58.7659 53.8097 13.0182 64.2369 38.7932 1.7941 33.9721 125.4010 13.0727 49.3067 49.5733 82.9627 29.7473 41.0011 41.3562 44.1993 72.6036 268.5406 74.4676 32.6331 20.9323 700.0792 190.9913 30.9374 40.5926 17.3804 5.0185 66.7818 37.6426 20.5559 14.7890 4.6273 15.1567 57.3906 6.5188 72.3707 11.6115 1.2377 18.0033 258.9506 37.6399 24.0552 46.2383 215.6770 82.8444 278.6012 33.0401 261.2632 6.0476 41.4999 37.9730 34.8970 26.6155 11.9022 15.6029 50.3204 9.3740 22.2614 14.5063 11.5919 12.5422 12.8748 0.4524 45.0564 14.4583
temp: 298.150 k
press: 1.00000 atm
elementType: 8 8 8 8 8 8 8 6 6 6 6 6 6 6 6 6 6 6 6 6 6 6 6 6 6 6 6 6 6 1 1 1 1 1 1 1 1 1 1 1 1 1 1 1 1 1 1
symmnumber: 1
zpe: 922018.4 jmol-1
zpe.correction: 0.351178 hartree
zpe.thermalcorrener: 0.377119 hartree
zpe.thermalcorrenthalpy: 0.378064 hartree
zpe.thermalcorrgfe: 0.294452 hartree
zpe.sumelectzpe: -1373.675866 hartree
zpe.sumelectthermal: -1373.649925 hartree
zpe.sumelectthermalent: -1373.648981 hartree
zpe.sumelectthermalfe: -1373.732593 hartree
dipole: 4.0502 0.2935 0.3451
dipole: 4.0754
quadrupole: -118.3939 -170.0748 -168.1778
quadrupole: 7.3300 0.5821 9.8928
quadrupole: 33.8216 -17.8593 -15.9623 7.3300 0.5821 9.8928
hfenergy: -1374.0270446 hartree
pointgroup: C01 [X(C22H18O7)]
dipole: 1.5888366 0.1238338 0.1764856 debye
polarizability: 500.2436286|27.5147968|302.1663218|23.9778518|4.5332072|137.6616746 unknown
InChI: InChI=1S/C22H18O7/c1-3-9-7-14(24)17-11(15(9)22(28)29-2)8-12-18(21(17)27)20(26)16-10(19(12)25)5-4-6-13(16)23/h4-6,8,14,23-24,27H,3,7H2,1-2H3
charge 0 multiplicity 1
47 atoms
O  -2.776377 -2.927288 1.063726
O  0.347615 -3.124837 0.047026
O  -2.891078 2.245242 1.018696
O  2.753426 -2.479331 0.19903
O  1.43609 2.877242 -0.167187
O  -4.439576 2.373119 -0.704722
O  5.331172 -1.817826 0.318319
C  -2.353532 -2.519601 -0.301742
C  -1.313495 -1.419592 -0.236791
C  -3.614206 -2.060518 -1.033855
C  -1.685843 -0.047938 -0.273474
C  -4.06026 -0.642517 -0.732607
C  -3.122816 0.311109 -0.381303
C  0.050676 -1.785268 -0.078406
C  1.083937 -0.791672 -0.036031
C  0.696061 0.579807 -0.12836
C  -0.656536 0.939276 -0.232199
C  -5.556485 -0.414876 -0.80597
C  2.483121 -1.210535 0.0998
C  1.736949 1.642316 -0.096844
C  3.540596 -0.174327 0.117827
C  3.173289 1.210523 0.022457
C  -3.563016 1.714911 -0.089851
C  -6.231017 -0.785518 0.548837
C  4.933529 -0.487885 0.226129
C  4.150799 2.228927 0.037496
C  5.904934 0.547635 0.238536
C  5.516299 1.89638 0.145287
C  -3.254258 3.636886 1.381364
H  -1.918034 -3.398906 -0.812603
H  -4.426881 -2.771375 -0.798086
H  -3.441429 -2.133571 -2.129215
H  -0.893567 2.003716 -0.275803
H  -5.974302 -1.067014 -1.597922
H  -5.793125 0.627382 -1.066802
H  -1.992777 -3.348891 1.502711
H  -5.969787 -1.81097 0.866567
H  -5.907113 -0.095094 1.347302
H  -7.329681 -0.717959 0.456264
H  1.393848 -3.177393 0.136047
H  3.813417 3.266365 -0.03683
H  6.968263 0.286766 0.322253
H  6.278045 2.682329 0.156738
H  6.319348 -1.878802 0.386389
H  -3.075724 4.314374 0.529582
H  -4.317984 3.689348 1.66801
H  -2.600216 3.881852 2.229408
