program: Gaussian 09
title: 000125949
version: EM64L-G09RevD.01
frameworkgroup: C1[X(C21H21NO2)]
method: RPBEPBE
basis: SDD
operation: Freq
keyword: #p
keyword: freq=noraman
keyword: PBEPBE/SDD
title: #p freq=noraman PBEPBE/SDD
converged: YES YES NO NO
title: Mulliken charges:
elementType: O O N C C C C C C C C C C C C C C C C C C C C C H H H H H H H H H H H H H H H H H H H H H
charge: -0.446976 -0.433661 -0.455731 0.274728 -0.518153 0.384625 0.286109 0.406056 0.263370 -0.578355 0.250067 0.248305 -0.447668 -0.358418 -0.416248 -0.439005 -0.736395 -0.426559 -0.427181 -0.230892 -0.435554 -0.435540 -0.238170 -0.239580 0.213871 0.248976 0.287209 0.165926 0.221511 0.217532 0.218677 0.251916 0.245193 0.246477 0.248684 0.198285 0.234317 0.251801 0.222739 0.252952 0.251372 0.228260 0.228109 0.374050 0.342968
chargesum: 0.00000
title: Mulliken charges with hydrogens summed into heavy atoms:
elementType: O O N C C C C C C C C C C C C C C C C C C C C C
charge: -0.072926 -0.090694 -0.168522 0.274728 -0.518153 0.384625 0.286109 0.406056 0.263370 -0.115508 0.250067 0.248305 -0.195752 0.029020 0.019961 -0.193812 -0.042949 -0.192242 -0.175380 -0.008153 -0.182602 -0.184168 -0.009910 -0.011471
polarizability: 3.89521672e+02 -1.44478423e+01 2.62640896e+02 2.65900550e+01 1.15347460e+01 1.29802666e+02
1716.lowfreq: -17.4806 -3.6705 -0.0006 -0.0005 0.0003 4.5579 9.2934 21.8670 28.5275
frequency: -9.9003 21.7643 28.5154 79.0187 99.5383 116.1667 119.2800 123.6927 126.4488 164.5576 187.6909 202.7188 223.4896 242.6478 279.0685 292.4634 295.6264 308.8350 329.8765 339.6043 365.9207 375.5072 431.4299 435.2061 455.6149 461.5681 470.9599 501.6253 525.2781 550.1468 553.7552 570.8954 584.6513 603.6468 629.8215 646.0848 659.4689 685.2737 719.2104 753.9230 755.1781 764.1604 775.7876 787.5695 794.5014 833.1902 843.5578 862.9944 887.7103 894.5763 917.8402 920.3489 922.1621 944.3731 952.0308 960.3119 967.5459 970.8454 979.2527 980.3104 985.3588 1007.5059 1015.8432 1022.2866 1053.5376 1063.9322 1082.7890 1097.5801 1110.0519 1147.9323 1155.8209 1165.7767 1174.4262 1181.1022 1205.1655 1209.7311 1220.4596 1233.1328 1245.0346 1259.9122 1287.0269 1291.1569 1294.3963 1330.3232 1338.1339 1349.8499 1364.0881 1383.9856 1385.5221 1400.0135 1410.6984 1412.0379 1436.9201 1438.6842 1442.3849 1459.3777 1468.2472 1471.6693 1478.1049 1483.3308 1493.2013 1496.5588 1501.9452 1581.6266 1612.6964 1614.7449 1618.1781 1622.1671 2891.1777 2933.7387 2965.9466 2977.8342 3035.0161 3037.0813 3064.3331 3073.2879 3102.9159 3121.5841 3123.7383 3124.4259 3132.1192 3137.5093 3144.0616 3146.7237 3156.2837 3163.1021 3166.4138 3479.4844 3571.3127
redmass: 4.5854 5.4500 5.6821 6.1279 3.9919 3.8598 3.8035 5.0496 3.3931 4.0305 4.1962 3.8319 3.9503 1.0848 3.5063 2.1577 2.5226 1.9453 3.0842 2.0504 2.7343 4.4756 3.3995 3.0979 4.6298 3.1906 4.0246 3.3624 4.3147 4.8561 6.0081 2.7030 4.4883 3.0659 2.4129 3.0558 5.7552 3.4448 4.6052 1.3809 1.1462 2.2744 2.7876 3.5196 2.4033 4.1527 4.4273 1.4499 1.5239 1.8654 1.6728 2.5417 2.1411 1.6964 1.4447 1.7300 1.4610 3.4776 1.7768 1.7523 1.3437 4.9140 2.8528 2.4275 2.4246 3.0704 2.7080 1.8598 1.4573 1.6380 1.5815 1.3968 1.1803 1.4717 1.5881 1.5902 1.9967 2.1491 1.9209 1.7147 2.1233 1.3308 1.6274 1.1965 1.6956 2.0362 1.2185 1.2857 2.9068 4.0084 1.3076 2.2557 1.2208 2.8548 3.1798 1.0854 3.9629 1.0607 4.5524 1.0702 1.0903 2.2264 1.4329 6.4042 6.6596 8.7393 7.5792 7.3737 1.0712 1.0689 1.0639 1.0385 1.0909 1.0909 1.0993 1.0966 1.1002 1.0886 1.0854 1.0855 1.0898 1.0918 1.0947 1.0953 1.0982 1.1001 1.0636 1.0760 1.0664
irintensity: 0.7778 0.4211 0.2385 0.7487 4.6755 6.3311 1.7162 3.9682 3.7886 2.4636 2.0231 0.1118 1.3729 0.1904 6.3428 72.9302 2.4717 35.1721 15.8291 30.6956 18.2761 1.1417 0.9453 0.6404 5.1727 0.4323 3.5021 5.2276 2.0533 0.6162 4.6274 9.6730 0.2214 25.8272 39.3420 3.8813 3.5615 1.7538 2.3176 58.1645 63.5748 33.8461 58.0805 24.7934 27.3314 0.7407 8.6210 18.6114 0.6635 16.6090 7.2215 10.0044 5.8519 14.0477 2.8431 6.9691 2.2291 96.6426 14.7989 12.0457 0.0023 47.8925 15.0687 3.2276 7.7475 19.7543 4.5321 1.9238 29.6627 57.5365 15.6150 3.2389 1.2117 39.6588 0.3401 8.0817 10.9281 3.1501 26.1621 15.0242 4.2511 24.2294 0.4489 28.7703 1.2660 4.0460 0.4107 32.8306 1.8080 5.0159 40.2233 12.8309 48.4810 12.8865 5.6569 4.4892 29.2564 7.9338 30.4908 13.0452 2.0194 9.0207 21.1499 0.1321 2.1086 1.9907 1.0826 0.5069 94.1194 42.9767 78.4018 18.1678 33.1117 43.4121 20.7857 31.4096 10.5763 14.3056 2.4329 0.3064 3.4385 17.2531 15.5502 22.9569 36.8109 50.0357 185.7591 1.8223 12.2117
temp: 298.150 k
press: 1.00000 atm
elementType: 8 8 7 6 6 6 6 6 6 6 6 6 6 6 6 6 6 6 6 6 6 6 6 6 1 1 1 1 1 1 1 1 1 1 1 1 1 1 1 1 1 1 1 1 1
symmnumber: 1
zpe: 962561.9 jmol-1
zpe.correction: 0.366620 hartree
zpe.thermalcorrener: 0.386630 hartree
zpe.thermalcorrenthalpy: 0.387574 hartree
zpe.thermalcorrgfe: 0.318242 hartree
zpe.sumelectzpe: -1016.323726 hartree
zpe.sumelectthermal: -1016.303716 hartree
zpe.sumelectthermalent: -1016.302772 hartree
zpe.sumelectthermalfe: -1016.372104 hartree
dipole: 1.5656 2.1041 -1.0138
dipole: 2.8118
quadrupole: -139.7370 -137.5596 -144.8933
quadrupole: -2.3285 9.3589 6.1717
quadrupole: 0.9929 3.1704 -4.1633 -2.3285 9.3589 6.1717
hfenergy: -1016.6903461 hartree
pointgroup: C01 [X(C21H21N1O2)]
dipole: -0.6254939 0.8374101 0.3623377 debye
polarizability: 388.5562813|16.1898122|261.8930907|29.8894379|-15.5302043|131.5158619 unknown
InChI: InChI=1S/C21H21NO2/c1-21(12-23,13-24)22-11-14-9-10-19-17-6-3-2-5-16(17)18-8-4-7-15(14)20(18)19/h2-10,22-24H,11-13H2,1H3
charge 0 multiplicity 1
45 atoms
O  4.034665 -2.484307 -0.408878
O  6.682114 0.925056 0.562507
N  3.077021 -0.040648 -0.366956
C  4.572642 -0.07288 -0.382674
C  -1.414652 0.372225 0.207299
C  -0.068936 0.771056 0.410885
C  -1.883742 -0.977551 0.303258
C  0.876153 -0.276242 0.733735
C  -2.484859 1.268465 -0.120071
C  2.352124 0.031826 0.935282
C  -3.339307 -0.936904 0.022713
C  -3.706796 0.435374 -0.236675
C  -0.956262 -1.977069 0.614722
C  4.972246 -1.506074 0.124239
C  5.21282 1.022817 0.514841
C  0.41359 -1.603715 0.822934
C  5.028127 0.109776 -1.846595
C  0.198575 2.179094 0.265831
C  -2.19612 2.630083 -0.254787
C  -0.841306 3.06651 -0.057206
C  -4.311146 -1.953464 -0.02045
C  -5.039809 0.770481 -0.536422
C  -5.652767 -1.606598 -0.322856
C  -6.01305 -0.260521 -0.578066
H  2.468361 1.014903 1.440955
H  2.796813 -0.72645 1.604469
H  2.674072 0.574153 -1.083777
H  4.971301 -1.533727 1.240051
H  5.983998 -1.769023 -0.232982
H  5.019301 2.022714 0.088591
H  4.791925 0.983879 1.541144
H  -1.245064 -3.029917 0.703188
H  1.139725 -2.391373 1.059635
H  4.736681 -0.764834 -2.454439
H  6.124922 0.222313 -1.882172
H  4.580268 1.018739 -2.293621
H  1.211552 2.571378 0.412224
H  -2.968954 3.365511 -0.50379
H  -0.61601 4.134097 -0.160975
H  -4.044491 -2.998007 0.174635
H  -5.32995 1.808032 -0.735535
H  -6.420182 -2.387626 -0.360157
H  -7.055218 -0.014665 -0.809953
H  3.228594 -1.912438 -0.639272
H  6.939132 0.137652 1.104971
