program: Gaussian 09
title: 000125966
version: EM64L-G09RevD.01
frameworkgroup: C1[X(C21H25NO6)]
method: RPBEPBE
basis: SDD
operation: Freq
keyword: #p
keyword: freq=noraman
keyword: PBEPBE/SDD
title: #p freq=noraman PBEPBE/SDD
converged: YES YES NO NO
title: Mulliken charges:
elementType: O O O O O O N C C C C C C C C C C C C C C C C C C C C C H H H H H H H H H H H H H H H H H H H H H H H H H
charge: -0.262978 -0.236537 -0.457240 -0.275361 -0.216630 -0.410499 -0.095881 0.196689 0.198171 0.460657 -0.361898 -0.167784 -0.552267 -0.520734 -0.439204 -0.000404 -0.316372 -0.582666 -0.406464 0.426945 0.129972 0.266830 -0.440057 -0.637558 0.105550 -0.365460 -0.220307 -0.679141 0.279367 0.194450 0.211034 0.266424 0.223502 0.231540 0.211268 0.235468 0.241886 0.219965 0.216590 0.205075 0.212722 0.330034 0.230941 0.218341 0.190739 0.228656 0.212675 0.356538 0.224668 0.248391 0.212912 0.232133 0.225312
chargesum: 0.00000
title: Mulliken charges with hydrogens summed into heavy atoms:
elementType: O O O O O O N C C C C C C C C C C C C C C C C C C C C C
charge: -0.262978 -0.236537 -0.127207 -0.275361 -0.216630 -0.053961 -0.095881 0.196689 0.198171 0.460657 -0.082531 0.026666 -0.074810 -0.065692 0.007533 -0.000404 -0.074486 -0.146112 0.011332 0.426945 0.129972 0.266830 -0.209116 0.000179 0.105550 -0.152785 0.252752 -0.008784
polarizability: 2.76178583e+02 1.05430767e+01 2.48109146e+02 -1.23350242e+01 4.93343715e+00 1.95059424e+02
1716.lowfreq: -6.3997 -0.0005 -0.0004 0.0008 5.1532 10.2814 17.3012 34.2205 49.8604
frequency: 15.9369 34.0139 49.8410 55.1058 67.1646 78.4262 89.9474 118.4904 142.8311 163.5745 173.9209 184.4972 200.5155 211.1254 219.5565 236.8825 245.4834 259.4216 264.9782 266.7051 287.3777 290.5654 295.8897 314.2135 319.7046 337.0375 340.9950 350.4319 366.0139 380.8401 404.3818 423.5438 429.9510 446.3728 446.9276 489.2579 508.1909 532.5619 548.6250 560.0771 574.8921 594.6158 602.5230 616.1187 636.9874 662.7620 677.9106 683.2720 734.8897 740.0556 754.8393 758.3740 778.8187 798.5376 805.7254 827.8745 840.2882 853.9126 864.4892 885.6029 898.3426 909.6544 922.3954 936.5466 943.8587 959.7504 962.6624 980.5342 1006.6658 1012.9909 1024.6427 1033.3322 1041.7085 1061.4374 1069.9986 1083.7658 1095.7441 1110.5918 1113.2090 1122.7091 1134.9392 1140.3126 1143.9961 1157.2719 1166.0696 1168.4249 1169.3751 1171.8485 1182.6153 1210.0884 1214.7041 1222.2601 1223.6315 1234.6879 1251.0278 1255.1311 1263.0509 1275.9890 1282.7865 1296.3459 1311.3856 1320.8868 1324.5979 1325.6198 1336.6544 1342.6090 1356.4578 1374.7163 1380.2250 1399.6003 1407.5632 1413.4456 1435.6537 1438.3756 1454.4105 1457.4687 1458.6359 1463.1676 1463.9300 1466.8248 1472.2059 1477.4662 1484.5719 1491.7056 1494.1299 1618.9944 1649.3137 1651.9377 2839.5887 2850.4759 2912.9161 2964.3355 2986.2542 2994.1257 2994.5137 3004.8438 3005.2951 3007.2636 3012.9329 3031.3642 3057.1621 3063.2716 3066.8062 3067.9131 3069.5986 3073.7591 3081.4219 3091.1119 3106.6946 3108.8456 3138.6231 3543.4009 3583.0177
redmass: 3.0329 5.1069 3.6392 3.5762 4.0148 4.1552 5.6588 4.9009 3.1387 2.9271 2.7000 2.9015 1.3788 4.0542 2.7372 3.7468 1.6450 3.2283 2.1995 2.6870 2.1488 1.4193 2.4695 3.9775 3.0454 5.1992 3.0012 4.5716 3.6907 3.2926 3.6740 3.8642 4.0037 5.6715 4.2174 4.0460 3.5147 4.3264 4.1468 4.4270 4.3497 4.9748 5.1337 4.2783 3.9388 4.1662 5.5340 4.8401 3.7488 8.6767 3.7936 3.5988 1.5290 1.1784 3.0969 2.3672 3.9792 3.2338 3.4352 4.4509 1.4832 4.2809 3.2942 3.6741 3.0442 2.5966 2.3635 2.3831 2.2374 2.6200 2.4619 2.2419 1.7537 2.9720 2.2541 2.2952 2.4092 1.5309 2.2285 1.7936 1.4719 2.0267 1.8018 1.8337 2.8784 1.2752 2.6688 2.1420 1.6720 1.8088 1.3811 1.5514 1.6157 1.5133 1.1398 1.7927 2.4790 1.6641 1.3352 1.8603 1.8890 1.5278 1.5179 1.4037 1.5136 1.6100 1.3739 1.4248 1.6709 1.2832 7.1733 4.0902 2.1206 1.5579 1.1328 1.0992 1.1102 1.0408 1.1010 1.0671 1.0664 1.0627 1.0640 1.0888 3.5169 8.8342 8.9717 10.5766 1.0630 1.0773 1.0684 1.0662 1.0635 1.0834 1.0358 1.0612 1.0706 1.0677 1.0586 1.0935 1.0985 1.1004 1.1032 1.0880 1.1007 1.1057 1.0873 1.0984 1.1033 1.0872 1.0952 1.0656 1.0661
irintensity: 0.8058 0.6386 0.2694 3.3075 1.3965 1.0138 0.8027 0.2495 1.8463 1.1785 0.5453 4.6959 0.1574 1.2353 0.6591 19.6774 3.6364 11.4625 10.8798 28.8258 7.8294 125.6072 33.3899 21.2787 15.4171 12.3357 1.2679 10.1426 2.1669 2.6506 6.1579 9.5083 0.5837 5.9781 8.0397 4.4269 1.3884 6.7059 8.0899 4.7615 2.0811 1.6067 2.6531 6.3736 1.0537 12.3068 10.9683 0.9665 11.9835 15.5983 31.7336 1.7597 39.4578 4.8235 4.3409 7.4256 31.6997 12.7719 33.7828 0.6609 4.6109 45.6003 49.0112 1.2826 12.8680 34.3295 8.9256 7.4760 14.6907 80.9164 65.5323 38.3410 20.6176 13.1113 34.8106 39.7952 26.5273 3.1772 7.1934 38.2638 5.9963 16.6800 19.8349 8.1834 135.1268 5.6054 193.7662 11.0272 31.2833 48.4286 3.2627 10.7945 3.3708 22.3442 0.8575 38.4501 47.2983 26.1435 4.5844 13.9313 1.4192 16.5740 3.4050 0.4304 5.3997 7.2386 1.1692 5.7075 2.2201 26.4508 3.1474 5.2242 17.2400 6.8287 14.5868 17.0357 15.7245 9.3397 17.2323 7.5936 3.6233 8.6319 12.2087 5.1915 66.7603 15.8567 32.5447 185.1823 91.5877 161.5736 119.5697 46.4130 40.4812 31.2137 20.2115 42.7225 30.0729 40.4423 19.3142 29.6173 15.1070 33.3332 18.9547 19.0040 16.1138 3.7369 15.1232 31.1295 49.1479 16.0170 22.6179 2.0629 37.2479
temp: 298.150 k
press: 1.00000 atm
elementType: 8 8 8 8 8 8 7 6 6 6 6 6 6 6 6 6 6 6 6 6 6 6 6 6 6 6 6 6 1 1 1 1 1 1 1 1 1 1 1 1 1 1 1 1 1 1 1 1 1 1 1 1 1
symmnumber: 1
zpe: 1119866.5 jmol-1
zpe.correction: 0.426535 hartree
zpe.thermalcorrener: 0.451979 hartree
zpe.thermalcorrenthalpy: 0.452923 hartree
zpe.thermalcorrgfe: 0.372351 hartree
zpe.sumelectzpe: -1319.161814 hartree
zpe.sumelectthermal: -1319.136369 hartree
zpe.sumelectthermalent: -1319.135425 hartree
zpe.sumelectthermalfe: -1319.215997 hartree
dipole: -3.6499 -2.7875 0.5090
dipole: 4.6207
quadrupole: -153.4663 -148.5169 -159.1216
quadrupole: -6.3450 -12.0308 -5.4681
quadrupole: 0.2353 5.1847 -5.4200 -6.3450 -12.0308 -5.4681
hfenergy: -1319.5883483 hartree
pointgroup: C01 [X(C21H25N1O6)]
dipole: 1.2667552 1.2504065 0.3696442 debye
polarizability: 273.0061727|12.1563327|251.4051229|13.5980435|5.1948089|194.9358576 unknown
InChI: InChI=1S/C21H25NO6/c1-3-26-17(24)16-20(28-16)6-7-21(25)13-10-11-4-5-12(23)15-14(11)19(21,18(20)27-15)8-9-22(13)2/h4-5,13,16,18,23,25H,3,6-10H2,1-2H3
charge 0 multiplicity 1
53 atoms
O  -1.42001 -0.884637 1.949832
O  -1.258978 -0.398296 -0.786549
O  1.394253 2.98333 0.894698
O  -3.904536 0.783186 0.010382
O  -4.269206 -1.38772 0.792254
O  -1.251601 -3.27011 -1.45494
N  3.388316 1.475422 -0.788005
C  0.687943 0.912279 -0.183826
C  1.550681 1.503944 0.949968
C  -1.23559 0.565812 1.515704
C  -0.851301 0.800716 0.042693
C  3.029701 1.110868 0.610249
C  1.072605 1.045282 2.346632
C  -0.429539 1.382587 2.515009
C  0.998577 1.646353 -1.533224
C  1.014897 -0.578393 -0.276838
C  -2.59437 0.050752 1.869469
C  3.284231 -0.419421 0.780886
C  2.421079 2.255856 -1.588999
C  2.204644 -1.229629 0.075288
C  -0.130445 -1.256986 -0.715216
C  -3.650869 -0.305916 0.843568
C  2.248187 -2.628264 -0.156168
C  4.778646 1.918535 -0.943378
C  -0.095686 -2.638399 -0.971231
C  1.129156 -3.308536 -0.697428
C  -4.895917 0.537619 -1.085852
C  -4.96096 1.813932 -1.917212
H  -1.424374 1.651908 -0.356727
H  3.681201 1.658416 1.338851
H  1.672928 1.558454 3.124198
H  1.208685 -0.041563 2.484409
H  -0.764743 1.138505 3.539039
H  -0.589004 2.463759 2.342882
H  0.27083 2.467427 -1.669008
H  0.851766 0.92596 -2.35671
H  -3.014824 0.319734 2.85013
H  3.313938 -0.688877 1.857935
H  4.285493 -0.648663 0.370654
H  2.782836 2.239885 -2.63603
H  2.373784 3.320924 -1.267117
H  2.0292 3.378916 1.545887
H  3.149784 -3.199727 0.092988
H  5.466641 1.211042 -0.444499
H  4.972972 2.938064 -0.520402
H  5.046105 1.942769 -2.015837
H  1.190926 -4.390929 -0.874213
H  -1.143711 -4.253198 -1.435088
H  -5.865931 0.278875 -0.623542
H  -4.541018 -0.332035 -1.666383
H  -5.68486 1.684288 -2.74244
H  -3.975232 2.045641 -2.355701
H  -5.284199 2.672763 -1.303941
