program: Gaussian 09
title: 000125884
version: EM64L-G09RevD.01
frameworkgroup: C1[X(C17H27NO)]
method: RPBEPBE
basis: SDD
operation: Freq
keyword: #p
keyword: freq=noraman
keyword: PBEPBE/SDD
title: #p freq=noraman PBEPBE/SDD
converged: YES YES NO NO
title: Mulliken charges:
elementType: O N C C C C C C C C C C C C C C C C C H H H H H H H H H H H H H H H H H H H H H H H H H H H
charge: -0.433180 -0.127703 0.034407 -0.277989 -0.525738 -0.588219 0.397471 0.120847 -0.749044 -0.401780 -0.314235 -0.470278 0.127509 -0.378176 -0.402129 -0.221075 -0.387756 -0.685293 -0.698347 0.186305 0.224978 0.235157 0.213749 0.207939 0.237065 0.249314 0.215245 0.221169 0.219545 0.221356 0.164425 0.200957 0.236135 0.209863 0.209975 0.204488 0.214842 0.224539 0.249014 0.208851 0.207738 0.219529 0.210321 0.207732 0.220635 0.359841
chargesum: 0.00000
title: Mulliken charges with hydrogens summed into heavy atoms:
elementType: O N C C C C C C C C C C C C C C C C C
charge: -0.073339 -0.127703 0.220712 -0.053012 -0.076832 -0.143215 0.397471 0.120847 -0.063315 0.039121 0.051148 -0.234143 0.127509 0.041662 0.017201 0.003463 -0.138742 -0.049175 -0.059660
polarizability: 2.39590492e+02 -6.39910689e+00 1.97536878e+02 8.44661364e+00 1.09790458e+01 1.38219009e+02
1716.lowfreq: 0.0006 0.0007 0.0008 8.0418 9.1109 17.8354 28.4808 47.1212 52.5826
frequency: 27.0337 47.1064 52.3344 73.1673 79.1260 95.1869 98.5987 117.4246 170.1628 179.4185 198.0415 203.5574 212.6742 217.6938 235.5682 238.3346 251.4489 276.5681 290.6129 302.7964 328.9033 345.7079 377.0202 393.0071 418.4186 488.6466 499.7171 509.4372 523.2171 544.6464 592.7583 619.9295 622.9094 672.0409 717.8006 740.3103 762.2549 791.3823 798.4916 814.6985 835.9109 859.9766 872.7444 881.4877 886.1742 894.8123 910.9185 931.7591 966.3567 988.1136 1001.6724 1034.9086 1038.5847 1043.7772 1047.3171 1059.0209 1075.1394 1087.5027 1098.9632 1101.2300 1123.7175 1135.3847 1140.2099 1165.3082 1170.7129 1180.5237 1192.3406 1209.2112 1229.4633 1242.2444 1247.6520 1267.2667 1285.3315 1288.2382 1293.3778 1297.1576 1309.7839 1313.1971 1318.3942 1325.6814 1334.7428 1345.3165 1356.3898 1382.7723 1385.2160 1387.7521 1390.0881 1395.1680 1400.1001 1448.3200 1454.9291 1460.6898 1469.7174 1471.9395 1476.9961 1477.6949 1479.0506 1479.9380 1481.4997 1483.1424 1491.2583 1494.5343 1496.9863 1596.1501 1622.4956 2822.9316 2835.1097 2925.0455 2964.3421 2969.9827 2973.6628 2978.9442 2981.1445 2986.0896 2988.9098 3005.7066 3017.4575 3021.4502 3026.8082 3043.4930 3051.1744 3068.6719 3071.4921 3072.1863 3074.7341 3077.1492 3081.3368 3094.5732 3118.4321 3144.3975 3171.7304 3577.1612
redmass: 3.7275 3.2733 3.7395 2.1085 2.5642 1.6018 3.0607 3.2408 2.1214 2.0934 1.8461 1.4681 2.1752 1.8245 3.2723 1.2014 3.9617 2.2853 2.9013 1.3865 2.5110 2.7800 2.5966 3.1979 3.7303 4.1797 3.8089 3.4997 4.0688 4.1483 3.7345 2.6485 3.5298 3.6130 2.2089 1.1272 1.1260 1.6710 3.7004 2.8573 2.3699 1.4796 1.6161 1.8129 1.3981 1.4976 1.8999 1.9885 1.3278 1.8388 2.0135 2.6983 2.5634 2.6138 2.2412 2.4926 2.1923 2.0646 2.1322 2.0845 2.0674 1.6670 1.5946 1.4559 1.6980 1.7019 2.0682 2.4521 1.4735 1.4206 1.2530 1.2460 1.3860 1.9663 1.2413 1.2940 1.3621 1.3050 1.3522 1.3771 1.4433 1.4384 1.3352 1.4821 1.2221 1.2809 1.2083 1.2731 3.2759 2.6765 1.2334 1.0727 1.0625 1.0702 1.0603 1.0494 1.1878 1.0571 1.3298 1.3153 1.1079 1.0834 1.1001 7.0615 6.7130 1.0790 1.0719 1.0586 1.0992 1.0358 1.0355 1.0599 1.0597 1.0799 1.0374 1.0605 1.0636 1.0979 1.0906 1.0943 1.1015 1.1016 1.1010 1.0993 1.1000 1.0991 1.0993 1.0998 1.0873 1.0926 1.0971 1.0652
irintensity: 0.1521 0.0476 0.0971 0.0790 0.2638 0.1518 0.4733 0.1113 1.0792 0.5994 1.0328 0.1968 0.6877 0.1261 0.3484 0.4306 0.5175 2.0035 1.5610 81.4569 25.7254 18.0890 0.4385 8.9272 6.2450 1.6041 10.8753 1.7007 1.5032 3.8266 1.5012 1.0449 5.8119 11.6802 12.2859 10.7218 4.4236 49.3529 9.2640 1.0247 3.1809 0.7415 8.3038 16.9539 0.3075 9.5399 12.1167 3.8511 0.7584 3.7874 0.6267 43.0808 45.3709 15.1240 7.5563 19.9116 8.8332 2.0028 27.4787 0.2850 4.2583 90.5014 64.5277 14.1067 43.9544 5.3693 5.6640 12.8315 34.5724 3.7366 4.4684 0.1626 7.5925 0.7534 8.8322 1.3308 0.2661 3.8786 0.6910 2.1965 7.9445 6.8179 2.7752 14.1270 13.4931 22.8884 15.1801 4.0097 8.5439 69.4425 0.6319 4.2486 0.8505 2.2994 3.5454 16.1902 0.3767 21.9112 4.8555 13.5855 17.2904 8.0972 1.8421 62.5892 10.8568 38.0614 119.5220 45.9192 20.6824 44.4397 42.4939 8.3359 19.2428 27.6012 20.4958 66.5509 24.6939 2.6097 5.8330 28.6123 9.0579 89.5909 100.6598 32.7347 57.8875 63.2739 13.9192 33.2191 8.5334 20.8306 14.7533 21.4667
temp: 298.150 k
press: 1.00000 atm
elementType: 8 7 6 6 6 6 6 6 6 6 6 6 6 6 6 6 6 6 6 1 1 1 1 1 1 1 1 1 1 1 1 1 1 1 1 1 1 1 1 1 1 1 1 1 1 1
symmnumber: 1
zpe: 1062802.6 jmol-1
zpe.correction: 0.404800 hartree
zpe.thermalcorrener: 0.425295 hartree
zpe.thermalcorrenthalpy: 0.426239 hartree
zpe.thermalcorrgfe: 0.355865 hartree
zpe.sumelectzpe: -792.482669 hartree
zpe.sumelectthermal: -792.462174 hartree
zpe.sumelectthermalent: -792.461230 hartree
zpe.sumelectthermalfe: -792.531604 hartree
dipole: 2.7196 -0.5241 -0.4274
dipole: 2.8024
quadrupole: -126.3669 -108.6724 -121.8259
quadrupole: -2.0129 -3.1883 1.8027
quadrupole: -7.4118 10.2827 -2.8709 -2.0129 -3.1883 1.8027
hfenergy: -792.8874692 hartree
pointgroup: C01 [X(C17H27N1O1)]
dipole: -1.073935 0.1822404 -0.1704928 debye
polarizability: 240.0485191|-4.8292213|197.9612146|-7.4631937|-9.0347564|137.3366457 unknown
InChI: InChI=1S/C17H27NO/c1-4-11-18(12-5-2)16-10-9-15-14(13(16)3)7-6-8-17(15)19/h6-8,13,16,19H,4-5,9-12H2,1-3H3
charge 0 multiplicity 1
46 atoms
O  4.13279 2.110908 -0.864338
N  -2.089071 0.070549 0.383763
C  -0.659699 0.268004 -0.025198
C  0.279075 -0.785517 0.644169
C  -0.131493 1.68222 0.319612
C  1.273714 1.912345 -0.284115
C  1.743775 -0.556209 0.259392
C  2.21458 0.723787 -0.13426
C  0.130717 -0.828994 2.192246
C  -2.590945 -1.316065 0.164774
C  -3.009934 1.111392 -0.155781
C  2.652119 -1.642577 0.335068
C  3.596032 0.875345 -0.442908
C  -2.657246 -1.824502 -1.304057
C  -4.48149 0.956219 0.287372
C  4.019409 -1.467012 0.032876
C  4.502284 -0.200479 -0.357351
C  -3.257958 -3.245086 -1.380749
C  -5.306086 2.215606 -0.059494
H  -0.551747 0.147446 -1.137143
H  0.00733 -1.787118 0.256441
H  -0.109186 1.801512 1.418111
H  -0.796259 2.467682 -0.077209
H  1.703044 2.820044 0.195307
H  1.163569 2.151447 -1.364509
H  -0.930705 -0.919516 2.479728
H  0.695792 -1.682992 2.606962
H  0.530968 0.08773 2.660326
H  -3.602462 -1.381594 0.605448
H  -1.970437 -2.015514 0.754233
H  -2.97425 1.165412 -1.276117
H  -2.670569 2.09403 0.216159
H  2.280314 -2.63104 0.631018
H  -3.268333 -1.130282 -1.91457
H  -1.643726 -1.8292 -1.750936
H  -4.949151 0.077132 -0.196184
H  -4.505992 0.777951 1.380362
H  4.710716 -2.314609 0.094704
H  5.55459 -0.030527 -0.60311
H  -2.654038 -3.964514 -0.795362
H  -4.287157 -3.26487 -0.974383
H  -3.300011 -3.611535 -2.422595
H  -4.920823 3.104452 0.474638
H  -5.267642 2.431601 -1.144313
H  -6.36733 2.087238 0.220416
H  3.440622 2.8177 -0.853942
