program: Gaussian 09
title: 000125871
version: EM64L-G09RevD.01
frameworkgroup: C1[X(C15H21N3O5S2)]
method: RPBEPBE
basis: SDD
operation: Freq
keyword: #p
keyword: freq=noraman
keyword: PBEPBE/SDD
title: #p freq=noraman PBEPBE/SDD
converged: YES YES NO NO
title: Mulliken charges:
elementType: S S O O O O O N N N C C C C C C C C C C C C C C C H H H H H H H H H H H H H H H H H H H H H
charge: 0.240872 0.369119 -0.451609 -0.158713 -0.414285 -0.294427 -0.250043 -0.159986 -0.327728 -0.121142 -0.175293 -0.469190 0.068414 -0.062162 -0.508964 0.479788 -0.374898 -0.211732 -0.656925 -0.413082 -0.690596 0.198602 0.122108 -0.614876 -0.615843 0.272053 0.322938 0.223302 0.308363 0.246045 0.245642 0.236754 0.210559 0.241434 0.308304 0.228072 0.247829 0.206037 0.359013 0.285377 0.224579 0.227219 0.233153 0.236022 0.245049 0.384842
chargesum: 0.00000
title: Mulliken charges with hydrogens summed into heavy atoms:
elementType: S S O O O O O N N N C C C C C C C C C C C C C C C
charge: 0.240872 0.369119 -0.092596 -0.158713 -0.029443 -0.294427 -0.250043 -0.159986 -0.019424 -0.121142 0.096761 -0.146252 0.068414 0.161140 -0.200601 0.479788 0.116790 0.025022 -0.656925 0.038911 -0.008658 0.198602 0.122108 0.122299 0.098382
polarizability: 3.24938921e+02 -2.59122783e+00 2.52482701e+02 2.35373743e+01 7.79492701e-01 1.70714674e+02
1716.lowfreq: -9.2675 -5.7793 -1.5193 0.0003 0.0010 0.0014 10.7813 14.5258 36.6311
frequency: 7.6403 13.7906 36.5392 44.5545 47.4874 55.7322 56.9850 66.0169 89.3595 90.6539 101.1338 106.1905 118.7393 128.1593 136.2785 144.4161 148.1660 168.0284 201.6645 206.5096 232.2972 242.6704 252.5100 279.1160 287.7133 312.8437 322.9962 336.2176 360.2324 366.5707 379.5584 396.5367 406.5425 422.0916 439.0503 444.6751 489.9520 501.9883 519.1384 539.0540 570.1118 575.5799 578.5117 594.0221 648.9288 671.8619 705.6839 711.6325 732.6495 767.9175 779.8978 794.7633 814.0850 823.4184 877.7768 890.7209 920.3633 934.6959 935.8563 944.5671 982.9486 994.4509 1022.1396 1029.9247 1043.9754 1051.6235 1053.2563 1056.1668 1064.5343 1092.5662 1099.3067 1101.1231 1124.2850 1132.3497 1133.7909 1142.6019 1160.2298 1168.0486 1173.7024 1187.4361 1214.5170 1236.7224 1237.0124 1242.6473 1260.3991 1266.8846 1270.2720 1288.9134 1301.6828 1304.3846 1319.6700 1340.2425 1363.2355 1374.9464 1388.3213 1393.0099 1413.3429 1436.4546 1445.9185 1458.3334 1465.5150 1470.4635 1474.3495 1478.4924 1489.2627 1496.8685 1497.7626 1501.2835 1587.8809 1606.2393 1728.7305 2910.7477 2947.0172 2961.9917 2965.8885 2973.8183 2994.5403 3012.3522 3036.3587 3042.0107 3049.6181 3055.4156 3056.6512 3091.4017 3091.9978 3105.5529 3107.2186 3117.0508 3123.4945 3420.4694 3532.0814 3546.5611
redmass: 4.8559 7.4549 4.8948 4.2477 4.0736 6.6066 3.4173 3.4101 6.2371 2.0801 3.6686 2.4735 5.3227 8.1988 2.0082 5.7596 1.5544 4.6428 1.8957 1.7110 4.2780 3.5945 4.7570 4.3261 4.9525 5.5388 4.3760 5.6236 4.2787 1.2895 3.3748 9.0595 5.6308 3.2100 3.8359 5.5073 2.6997 3.5205 3.9328 3.3236 4.7393 2.6759 2.6199 3.1100 7.3467 5.6382 3.0496 8.9985 4.3185 6.7622 4.8326 6.3994 3.8660 3.6678 5.4555 2.1105 3.0634 2.9261 2.7444 1.8488 2.2869 2.7224 2.6394 3.8061 2.0387 1.6418 1.9535 2.1539 2.2939 1.2382 2.8669 2.0464 2.7124 1.9302 1.3854 1.4010 1.6993 2.6363 1.2479 1.2331 1.3175 4.4000 1.2852 1.3136 1.3676 2.0320 2.2841 1.3109 1.1319 1.2879 1.3613 1.3619 1.6955 4.2481 2.7292 1.3173 1.1763 1.3505 1.1617 1.0489 1.0834 1.0520 1.0768 1.0465 1.0498 2.1010 1.8570 1.2218 5.3989 8.2459 12.8108 1.0710 1.0840 1.0848 1.0391 1.0365 1.0359 1.0625 1.0892 1.0985 1.1019 1.0886 1.0852 1.1030 1.0998 1.0991 1.0909 1.0964 1.0975 1.0740 1.0643 1.0662
irintensity: 0.6391 0.2953 1.8216 0.4510 0.8213 0.1577 1.2869 3.6406 1.9393 0.6782 1.7815 2.9841 1.6225 1.4079 0.7092 2.7794 0.4417 1.6001 3.0001 0.4301 5.0902 3.2206 2.2125 7.6353 7.2786 3.3154 9.4797 3.9773 20.8563 209.9727 27.3053 4.4160 27.4666 11.5124 2.6609 2.0146 14.4039 23.6312 13.0985 26.7914 9.7805 46.9464 120.4285 96.4973 18.6690 12.7047 51.6793 4.0427 9.4006 7.3757 9.6760 32.4183 22.9262 10.6081 13.6627 8.0465 35.2403 5.1070 5.4399 5.7766 0.9249 8.4336 46.0932 343.7326 30.0312 25.9558 23.1298 32.1440 67.7605 1.4716 3.3829 95.5951 145.8399 28.2099 17.6298 0.6517 78.7462 12.0547 6.8450 7.6697 5.9714 22.3859 34.4833 0.0056 62.5092 78.3855 12.6281 1.5438 4.5670 15.1172 15.2313 32.4632 66.4961 88.0797 84.8819 30.3802 45.6269 24.8003 23.4498 7.6531 10.0743 15.7149 13.2499 10.1312 28.8191 196.2811 125.2107 10.3775 205.3936 225.1282 511.7794 68.5673 55.2128 38.7374 35.7207 85.0272 13.3267 8.0066 22.4387 45.6113 26.1466 19.9448 3.9988 16.0179 30.2002 30.3776 2.3273 19.7573 1.1927 58.7196 69.7569 10.3178
temp: 298.150 k
press: 1.00000 atm
elementType: 16 16 8 8 8 8 8 7 7 7 6 6 6 6 6 6 6 6 6 6 6 6 6 6 6 1 1 1 1 1 1 1 1 1 1 1 1 1 1 1 1 1 1 1 1 1
symmnumber: 1
zpe: 927604.1 jmol-1
zpe.correction: 0.353306 hartree
zpe.thermalcorrener: 0.380643 hartree
zpe.thermalcorrenthalpy: 0.381587 hartree
zpe.thermalcorrgfe: 0.291418 hartree
zpe.sumelectzpe: -1918.739172 hartree
zpe.sumelectthermal: -1918.711834 hartree
zpe.sumelectthermalent: -1918.710890 hartree
zpe.sumelectthermalfe: -1918.801059 hartree
dipole: -0.7572 -6.4596 0.1462
dipole: 6.5055
quadrupole: -176.3321 -150.4556 -171.2001
quadrupole: 15.4534 -11.4981 -6.5569
quadrupole: -10.3361 15.5404 -5.2042 15.4534 -11.4981 -6.5569
hfenergy: -1919.0924774 hartree
pointgroup: C01 [X(C15H21N3O5S2)]
dipole: 0.2022376 2.5313873 -0.3194694 debye
polarizability: 321.7799085|-4.4968804|250.3053828|-31.978842|-12.7316514|176.0510055 unknown
InChI: InChI=1S/C15H21N3O5S2/c1-6(19)9-12(21)18-10(14(22)23)15(25-13(9)18)24-7-4-8(16-5-7)11(20)17(2)3/h6-9,13,16,19,22H,4-5H2,1-3H3
charge 0 multiplicity 1
46 atoms
S  -0.878169 0.576122 -0.729433
S  0.625787 -2.118138 0.033701
O  -5.675511 1.218525 -0.873894
O  -4.1444 0.284863 2.487406
O  -3.698096 -2.981981 1.461414
O  6.026964 -0.318232 -0.102041
O  -1.47438 -3.695259 1.357767
N  -3.079941 -0.488068 0.409934
N  4.070135 -1.067745 -1.828186
N  5.223228 1.83113 0.283703
C  -3.535725 1.607569 0.323638
C  -2.816996 0.566761 -0.591376
C  -3.681412 0.423752 1.346112
C  -4.834842 2.238824 -0.221565
C  1.839104 -1.092141 -1.019064
C  -2.086464 -1.511347 0.525549
C  2.584342 0.011291 -0.239814
C  3.865974 0.22118 -1.113393
C  -0.857481 -1.115548 0.001757
C  2.980541 -2.022569 -1.493671
C  -4.570603 3.308292 -1.287035
C  5.120988 0.564048 -0.268572
C  -2.345226 -2.809323 1.136188
C  6.389383 2.152374 1.128445
C  4.221622 2.899988 0.147297
H  -2.865305 2.385914 0.726816
H  -3.226411 0.394415 -1.595485
H  -5.37647 2.687094 0.639426
H  1.275834 -0.687472 -1.877024
H  2.862384 -0.371157 0.760004
H  1.984138 0.926398 -0.109958
H  3.688858 1.033361 -1.848269
H  3.256993 -2.729069 -0.67628
H  2.676193 -2.618047 -2.371954
H  5.015472 -1.433692 -1.63876
H  -4.028898 2.875899 -2.146986
H  -5.528506 3.709808 -1.656801
H  -3.974021 4.139815 -0.87137
H  -5.961124 0.540823 -0.207995
H  7.031346 1.260953 1.185911
H  6.063352 2.437506 2.1469
H  6.964112 2.990991 0.691386
H  4.735056 3.861112 -0.041419
H  3.617559 3.009075 1.070051
H  3.5419 2.708951 -0.695538
H  -3.803588 -3.864345 1.908277
