program: Gaussian 09
title: 000125774
version: EM64L-G09RevD.01
frameworkgroup: C1[X(C6H11NO2S)]
method: RPBEPBE
basis: SDD
operation: Freq
keyword: #p
keyword: freq=noraman
keyword: PBEPBE/SDD
title: #p freq=noraman PBEPBE/SDD
converged: YES YES NO NO
title: Mulliken charges:
elementType: S O O N C C C C C C H H H H H H H H H H H
charge: 0.173423 -0.410721 -0.237518 -0.653622 -0.324544 -0.154662 -0.678021 0.147168 -0.287874 -0.510548 0.236482 0.224031 0.257345 0.268629 0.285465 0.318306 0.282598 0.233054 0.385383 0.218312 0.227314
chargesum: 0.00000
title: Mulliken charges with hydrogens summed into heavy atoms:
elementType: S O O N C C C C C C
charge: 0.173423 -0.025338 -0.237518 -0.052718 0.135969 0.102683 -0.123927 0.147168 -0.054820 -0.064922
polarizability: 1.33599645e+02 -5.10056734e+00 7.34375345e+01 5.44940423e+00 3.52453518e+00 8.57434316e+01
1716.lowfreq: -6.6741 -3.3317 -0.0016 -0.0015 0.0018 15.4093 28.5316 42.8851 51.3927
frequency: 28.4017 42.7701 51.2280 60.0567 79.8494 129.1485 182.5823 203.4776 250.7436 281.9267 327.1201 378.1334 446.8822 481.8864 518.3684 561.5834 575.2635 617.2962 665.2375 683.8457 746.0370 785.9122 820.1003 887.6248 922.4178 947.2919 980.0274 1025.5834 1049.4049 1072.4885 1094.5006 1164.1695 1196.5758 1220.6810 1258.8620 1266.8012 1286.9812 1291.4873 1357.1393 1381.3663 1392.3219 1456.8794 1465.1022 1601.2860 1604.0837 1663.4867 2894.5768 3006.1892 3018.9165 3069.0767 3097.7208 3102.1024 3128.0189 3209.0206 3501.5941 3520.1174 3646.3108
redmass: 5.2931 7.7560 2.1565 3.7761 3.9576 2.6318 3.5148 1.1880 3.9583 4.3323 3.0897 3.4101 4.0436 1.8914 2.0387 2.3983 1.5058 1.6233 4.1750 4.2448 3.7733 1.2600 3.7973 1.3824 2.5294 1.0766 1.5461 1.4257 2.8188 2.5621 1.3489 1.1997 1.9043 1.4334 1.2461 1.5009 1.2132 1.3254 1.4000 1.8411 1.2009 1.0910 1.0968 3.8670 1.3806 3.6204 1.0808 1.0612 1.0562 1.1016 1.0589 1.1074 1.0964 1.1151 1.0461 1.0642 1.0995
irintensity: 1.1552 1.1697 1.9043 0.2588 0.2331 1.6479 2.9321 26.5547 1.9410 2.3886 6.2477 4.5069 24.7023 102.0971 141.9990 6.3572 16.0993 186.8230 25.9789 37.1413 8.3110 13.4011 3.6798 63.9712 2.2405 53.9127 0.3869 23.2261 237.9541 44.2404 6.4554 12.2414 4.4854 6.0050 16.9459 11.9488 1.1180 10.1857 5.0531 9.2583 6.0979 7.5733 8.7651 101.0010 170.5769 134.6841 53.7732 13.2809 25.7604 7.4710 3.3463 25.9908 7.7099 14.2065 14.9659 32.7284 19.5693
temp: 298.150 k
press: 1.00000 atm
elementType: 16 8 8 7 6 6 6 6 6 6 1 1 1 1 1 1 1 1 1 1 1
symmnumber: 1
zpe: 434830.9 jmol-1
zpe.correction: 0.165618 hartree
zpe.thermalcorrener: 0.178248 hartree
zpe.thermalcorrenthalpy: 0.179192 hartree
zpe.thermalcorrgfe: 0.124393 hartree
zpe.sumelectzpe: -837.669379 hartree
zpe.sumelectthermal: -837.656749 hartree
zpe.sumelectthermalent: -837.655805 hartree
zpe.sumelectthermalfe: -837.710604 hartree
dipole: -2.1220 0.3852 -0.4801
dipole: 2.2095
quadrupole: -67.4713 -61.2834 -70.3556
quadrupole: -0.2054 7.8952 -1.4193
quadrupole: -1.1012 5.0867 -3.9855 -0.2054 7.8952 -1.4193
hfenergy: -837.8349973 hartree
pointgroup: C01 [X(C6H11N1O2S1)]
dipole: 0.8372355 -0.209922 -0.1029462 debye
dipolederiv: -0.4723783 0.0812842 0.1418278 0.1658618 -0.1288001 -0.0007197 0.4424848 -0.056045 -0.1557747 -0.4433986 -0.0028906 0.0883504 -0.0498385 -0.7177611 0.5113658 0.1099611 0.4465282 -0.7725289 -0.465166 -0.0636566 -0.2316686 -0.2437958 -0.571548 -0.1559994 -0.2611117 0.0808723 -0.8863444 -0.8578146 0.052114 0.096644 0.100304 -0.4115964 0.2303785 0.0302158 0.1799418 -0.5562703 -0.0338924 0.107294 -0.0098183 -0.042767 0.065761 -0.0285849 -0.1350642 0.0873659 0.064457 0.3088072 -0.2059476 -0.0155382 -0.2190539 0.0978665 -0.2590575 -0.0813141 -0.3827844 0.3814269 0.4142243 0.0245227 0.0607637 0.0441211 0.1377599 -0.0396379 0.0832179 -0.0331757 -0.0382578 0.4870894 0.2151561 0.2613689 0.5158128 1.0754815 -0.1722479 0.3196654 -0.2676849 1.3095717 0.5900859 -0.2367436 -0.3475287 -0.2699321 -0.1223575 0.0699301 -0.6094658 0.1057616 0.2927758 -0.5593793 0.0186416 0.1647852 0.0134119 -0.4375204 -0.0574256 0.1896165 -0.0558068 0.0295319 0.0666189 0.0137625 0.0057643 0.0147317 0.0357407 0.1035332 0.0439209 0.070991 -0.0594377 0.0481649 -0.0661942 -0.0410761 -0.0248517 -0.1067238 -0.068778 0.0019283 -0.0717426 0.0618231 -0.1092438 0.0281254 0.1089083 0.0379965 0.0185224 -0.0194529 0.115524 0.0241573 -0.1075731 -0.0803728 -0.0528859 -0.0321897 -0.0702191 -0.0945877 -0.0551308 -0.0824959 -0.0509153 0.0435472 0.0379513 -0.0254516 -0.0050945 -0.0744018 0.0641301 0.0512163 0.0113827 0.0474447 -0.051294 0.2568107 0.0003259 -0.1239166 -0.0218144 0.2410723 -0.0299112 -0.0668932 0.0199699 0.2027279 0.3650513 0.0450456 -0.0477597 0.0036356 0.0771426 -0.0183875 -0.0236261 -0.0445435 0.1683551 0.0168745 0.0515348 -0.0575595 0.0958166 0.1567513 0.0055477 0.0188266 0.0027764 -0.0988105 0.3506729 -0.0749874 -0.0643767 -0.0598677 0.2297335 -0.0703386 -0.1105112 -0.1223082 0.2598498 -0.0087001 0.0517398 0.0963443 0.0484923 0.198804 -0.006006 0.0843679 -0.0118887 -0.0317446 0.0879945 0.0392108 -0.0482302 0.0363577 0.1921292 0.0097064 -0.0806298 0.0310857 -0.0560307 unknown
polarizability: 133.7062843|-6.8526577|72.6638185|-2.1352264|1.2099207|86.4105083 unknown
InChI: InChI=1S/C6H11NO2S/c1-2-10-4-3-5(7)6(8)9/h2,5,8H,1,3-4,7H2
charge 0 multiplicity 1
21 atoms
S  -2.360345 -0.203828 -0.914968
O  2.342604 1.39632 -1.022998
O  2.780558 0.838131 1.187383
N  1.750947 -1.694773 0.869683
C  0.392228 -0.73293 -1.018437
C  1.790255 -0.856764 -0.327694
C  -0.659567 -0.133964 -0.0766
C  2.346817 0.513741 0.059448
C  -3.417976 0.139084 0.527028
C  -4.722033 0.501758 0.44329
H  0.497691 -0.123539 -1.934039
H  0.079681 -1.750706 -1.320201
H  2.487641 -1.241459 -1.11022
H  -0.440781 0.921372 0.16027
H  -0.704926 -0.725689 0.853022
H  2.272858 -1.33497 1.671955
H  1.813444 -2.700416 0.71797
H  -2.922796 -0.01239 1.494842
H  2.726439 2.26993 -0.740157
H  -5.314813 0.639325 1.35394
H  -5.229125 0.663766 -0.51392
