program: Gaussian 09
title: 000125776
version: EM64L-G09RevD.01
frameworkgroup: C1[X(C11H28N4)]
method: RPBEPBE
basis: SDD
operation: Freq
keyword: #pfreq=noraman
keyword: PBEPBE/SDD
title: #p freq=noraman PBEPBE/SDD
converged: YES YES NO NO
title: Mulliken charges:
elementType: N N N N C C C C C C C C C C C H H H H H H H H H H H H H H H H H H H H H H H H H H H H
charge: -0.273890 -0.273863 -0.546164 -0.546153 -0.412891 -0.353764 -0.353758 -0.365186 -0.365185 -0.376485 -0.376507 -0.350013 -0.349989 -0.410432 -0.410446 0.167309 0.241573 0.169691 0.204737 0.169673 0.204735 0.172992 0.205895 0.205886 0.172988 0.215690 0.176142 0.176178 0.215660 0.234263 0.234261 0.183506 0.181440 0.181445 0.183495 0.204540 0.208313 0.208313 0.204546 0.259846 0.260884 0.260887 0.259838
chargesum: 0.00000
title: Mulliken charges with hydrogens summed into heavy atoms:
elementType: N N N N C C C C C C C C C C C
charge: -0.039627 -0.039602 -0.025435 -0.025428 -0.004009 0.020664 0.020650 0.013700 0.013689 0.015348 0.015332 0.014934 0.014951 0.002422 0.002413
polarizability: 2.09955208e+02 -1.24750387e-03 1.28740840e+02 3.03807835e-03 -1.44536723e+00 1.22627197e+02
1716.lowfreq: -0.0015 -0.0014 0.0014 2.1534 4.2550 15.1860 21.7813 35.5807 36.3240
frequency: 15.4608 25.6962 36.3234 40.5344 62.5112 67.9769 75.5012 92.2973 101.3177 118.0629 130.4892 134.6815 148.9072 152.6153 154.0592 170.0524 184.3811 255.5695 255.6861 263.7003 287.8828 347.6361 396.8135 414.1149 484.6484 508.5788 524.2108 608.9295 611.0820 670.0984 684.7872 734.7869 734.8640 769.7553 779.2711 780.8043 872.6089 890.2838 894.1795 981.2523 989.5439 996.1190 1006.3283 1013.8755 1019.5962 1037.4933 1055.5212 1068.0885 1069.6744 1079.9552 1089.3391 1094.7353 1100.9385 1114.9297 1122.0154 1139.9636 1152.7577 1191.7474 1203.9285 1235.2895 1237.1288 1237.8628 1243.2382 1269.7700 1271.2912 1279.2458 1280.3482 1280.9349 1285.4510 1286.5392 1315.5994 1323.6242 1335.3271 1335.4442 1347.1236 1355.5359 1356.1099 1359.9195 1390.8057 1397.0508 1449.7268 1451.6050 1457.8113 1457.8234 1466.0115 1466.1616 1471.0005 1476.9387 1477.8635 1486.8120 1491.3431 1497.6520 1502.6269 1643.2695 1643.2790 2828.3759 2833.0611 2837.4893 2844.5548 2950.9110 2951.5763 2951.7207 2956.6541 2956.7242 2980.8555 2980.8843 2988.8474 2990.3652 2990.8986 2996.8216 2997.4115 2997.4253 3030.6987 3030.7472 3048.0404 3048.1226 3062.1717 3416.2061 3416.2785 3449.2851 3449.3066 3575.2159 3575.2400
redmass: 4.1687 4.7603 4.0471 1.5578 4.2812 3.5753 1.5674 2.3275 2.1809 3.7897 2.8653 1.6905 2.0970 4.6547 2.2006 2.3931 3.6774 1.0756 1.0754 3.3822 4.5614 2.9356 3.4717 3.2255 2.6305 3.0085 2.6741 1.5970 1.6289 1.3326 1.2829 1.0725 1.0724 1.0836 1.1327 1.1333 1.1921 1.2057 1.2372 4.5994 2.5255 4.6020 1.2417 1.2705 3.1144 3.8973 2.8674 2.3789 2.9304 2.4840 3.3121 1.5044 3.4512 2.9819 1.2134 4.0558 4.2426 1.9224 1.5093 1.4085 1.2910 1.3153 1.3199 1.2177 1.2442 1.0896 1.0676 1.1176 1.1699 1.1975 1.2640 1.3419 1.1709 1.1706 1.3482 1.3350 1.4025 1.5399 1.4499 1.5526 1.2037 1.2151 1.0754 1.0754 1.0771 1.0783 1.0766 1.0920 1.0912 1.0951 1.0961 1.0852 1.0858 1.0886 1.0886 1.0719 1.0716 1.0713 1.0713 1.0679 1.0605 1.0616 1.0638 1.0638 1.0612 1.0612 1.0866 1.0836 1.0833 1.0828 1.0980 1.0980 1.1013 1.1013 1.1049 1.1049 1.0951 1.0739 1.0739 1.0445 1.0445 1.0973 1.0973
irintensity: 0.1862 0.0453 0.0097 0.1187 0.8140 1.1139 4.5737 0.0298 0.2211 0.4276 2.1607 1.3237 6.9519 0.1017 0.0783 3.9819 3.8169 10.2542 107.4764 3.1219 0.8627 24.5896 2.7022 10.1414 22.4935 2.5952 0.9918 593.0288 72.5498 2.8413 192.3673 0.8967 17.4837 4.8232 0.2874 0.9889 3.5894 0.4050 0.3738 10.7708 17.1633 2.0370 0.4264 0.5034 0.0048 4.1829 0.5130 2.4288 28.5100 12.5582 3.7158 0.5278 4.4468 1.6114 38.6789 119.1769 0.6464 3.4611 5.5680 1.2518 10.8460 2.0234 0.2957 1.3158 0.5223 0.2041 0.2562 3.0290 0.0162 3.7450 0.0404 0.6629 0.3839 0.2040 0.0029 25.3001 1.1860 34.8249 1.1215 1.0239 66.9784 0.1365 0.3238 0.1936 0.2998 0.5868 0.7637 4.2186 19.8638 7.6578 3.5682 0.2911 5.4686 11.4869 52.6207 76.7625 29.3616 6.9922 353.6907 17.9585 2.0886 7.7743 9.9250 71.5981 4.1385 115.9495 1.3997 66.2274 1.0107 112.5995 4.1961 8.2175 2.2432 10.3843 1.3254 253.8192 45.9796 2.5567 2.5540 1.3106 1.4881 0.0753 0.0759
temp: 298.150 k
press: 1.00000 atm
elementType: 7 7 7 7 6 6 6 6 6 6 6 6 6 6 6 1 1 1 1 1 1 1 1 1 1 1 1 1 1 1 1 1 1 1 1 1 1 1 1 1 1 1 1
symmnumber: 1
zpe: 1028838.8 jmol-1
zpe.correction: 0.391864 hartree
zpe.thermalcorrener: 0.412793 hartree
zpe.thermalcorrenthalpy: 0.413737 hartree
zpe.thermalcorrgfe: 0.338831 hartree
zpe.sumelectzpe: -653.640703 hartree
zpe.sumelectthermal: -653.619774 hartree
zpe.sumelectthermalent: -653.618830 hartree
zpe.sumelectthermalfe: -653.693736 hartree
dipole: -0.0003 -3.0315 -1.8889
dipole: 3.5719
quadrupole: -124.2151 -97.3961 -92.5539
quadrupole: 0.0005 0.0034 -3.7835
quadrupole: -19.4934 7.3256 12.1678 0.0005 0.0034 -3.7835
hfenergy: -654.032567 hartree
pointgroup: C01 [X(C11H28N4)]
dipole: 0.0000119 -1.1992791 -0.7324898 debye
polarizability: 209.9552067|0.0095848|128.7145549|-0.0020925|-1.4997003|122.653483 unknown
InChI: InChI=1S/C11H28N4/c12-6-1-3-8-14-10-5-11-15-9-4-2-7-13/h14-15H,1-13H2
charge 0 multiplicity 1
43 atoms
N  -2.490777 0.197234 -0.005407
N  2.491408 0.198438 -0.006092
N  -8.880576 0.015262 0.006482
N  8.881253 0.01714 0.006347
C  0.000286 0.200231 0.003613
C  -1.281747 -0.654089 -0.028173
C  1.282727 -0.653381 -0.028372
C  -3.770283 -0.54449 -0.028947
C  3.771082 -0.542979 -0.029785
C  -4.974334 0.415973 0.013741
C  4.974998 0.417712 0.01174
C  -6.333986 -0.318123 -0.010871
C  6.3347 -0.316319 -0.011621
C  -7.547082 0.651053 0.02556
C  7.547738 0.652923 0.024564
H  -0.00002 0.890729 -0.868707
H  0.000114 0.830742 0.910549
H  -1.250991 -1.337198 -0.91754
H  -1.309611 -1.307281 0.867531
H  1.252085 -1.336737 -0.917595
H  1.311182 -1.306457 0.867415
H  -3.86572 -1.215671 -0.922823
H  -3.796812 -1.204789 0.861659
H  3.798236 -1.202738 0.861204
H  3.866195 -1.214683 -0.923316
H  -4.893115 1.040815 0.924612
H  -4.919863 1.11218 -0.85126
H  4.920643 1.112671 -0.854257
H  4.893521 1.043792 0.921753
H  -2.45964 0.906595 -0.752867
H  2.459861 0.907492 -0.753835
H  -6.399927 -1.009534 0.85561
H  -6.404887 -0.948542 -0.922539
H  6.406063 -0.947466 -0.922752
H  6.400272 -1.007032 0.855444
H  -7.486402 1.343695 -0.837004
H  -7.482337 1.282293 0.933359
H  7.482685 1.284731 0.931948
H  7.487327 1.345023 -0.838451
H  -9.082566 -0.500843 -0.856103
H  -9.08319 -0.549968 0.83751
H  9.083622 -0.547469 0.83786
H  9.08347 -0.499635 -0.855785
