program: Gaussian 09
title: 000125771
version: EM64L-G09RevD.01
frameworkgroup: C1[X(C18H17N2)]
method: RPBEPBE
basis: SDD
operation: Freq
keyword: #p
keyword: freq=noraman
keyword: PBEPBE/SDD
title: #p freq=noraman PBEPBE/SDD
converged: YES YES NO NO
title: Mulliken charges:
elementType: N N C C C C C C C C C C C C C C C C C C H H H H H H H H H H H H H H H H H
charge: -0.460137 -0.067536 0.063921 -0.021720 0.126980 0.202203 0.258583 0.362002 0.173885 0.216439 -0.380401 -0.829920 -0.298361 -0.813700 -0.324802 -0.367621 -0.228031 -0.269303 -0.192560 -0.591004 0.328090 0.274130 0.272864 0.262903 0.225014 0.262880 0.226211 0.257531 0.257435 0.248950 0.255092 0.279559 0.246615 0.249467 0.244437 0.275084 0.274819
chargesum: 1.00000
title: Mulliken charges with hydrogens summed into heavy atoms:
elementType: N N C C C C C C C C C C C C C C C C C C
charge: -0.132047 -0.067536 0.063921 -0.021720 0.126980 0.202203 0.258583 0.362002 0.173885 0.216439 -0.106271 -0.079123 -0.025497 -0.072523 -0.075852 -0.112529 0.051528 -0.022687 0.056907 0.203337
polarizability: 4.25083966e+02 -2.35817113e+00 2.17920773e+02 -5.39118512e-03 -1.21018483e-02 9.02173397e+01
1716.lowfreq: -8.4505 -0.0006 0.0002 0.0006 5.3596 8.7500 40.3014 61.9180 66.4323
frequency: 40.2414 61.9101 66.4128 77.0936 103.9322 119.7414 152.8809 172.7343 174.9481 241.0392 245.1962 275.4418 297.7633 310.8463 342.0920 347.1464 394.0656 405.8423 435.6070 463.5985 466.8240 476.1053 550.1753 566.4225 566.4597 585.8418 590.1701 611.1567 618.8750 660.6927 688.4422 718.9813 742.8399 764.4054 766.3471 785.2775 803.9947 825.3050 867.8998 870.7781 908.9492 915.2218 941.3906 953.0743 960.1268 995.9313 1025.0662 1032.4210 1033.7363 1036.6044 1056.1585 1067.8873 1101.2178 1118.3846 1122.9922 1128.7316 1173.1809 1178.3741 1188.7134 1224.4741 1250.1328 1257.2836 1314.4035 1330.0735 1346.8956 1365.9944 1387.6693 1407.3160 1413.3537 1415.3473 1418.9981 1442.3143 1447.5872 1454.1131 1468.0170 1469.9179 1473.1760 1480.0862 1481.7263 1485.6831 1492.3379 1507.8654 1520.8653 1584.7026 1588.9840 1599.2190 1629.4957 1642.1272 2987.6677 2990.3628 3016.8668 3062.8029 3064.5031 3092.9333 3113.9067 3115.4754 3141.7824 3146.5610 3157.4720 3172.6266 3183.4420 3188.0381 3197.2459 3207.1171 3598.0244
redmass: 2.6710 1.1592 1.1217 3.1622 2.3834 2.6855 4.4650 2.0460 1.8236 3.2124 3.5693 4.1020 3.6495 4.1942 4.4357 3.4123 4.0012 3.9209 3.2930 4.7646 3.2873 5.0187 3.1528 5.3906 1.4500 2.6604 6.3752 4.2163 3.8481 5.1318 6.2706 4.4634 4.6730 2.7006 1.6153 4.3505 1.8692 2.3597 3.6112 1.4686 1.5537 2.9717 4.2836 1.3889 1.3126 1.3386 2.1181 3.1808 1.5021 1.5700 1.7982 2.3187 2.0302 1.8280 1.3384 2.8621 1.3492 2.4521 1.5621 1.8046 2.3328 1.5196 1.9206 3.1110 2.8225 2.4772 2.3541 2.2816 1.3348 1.4704 2.3159 1.5721 3.8530 2.2465 1.0408 1.0418 1.0420 1.8200 1.1819 1.7578 1.5642 3.7583 2.0424 7.8394 6.0578 5.5535 6.7569 6.2992 1.0392 1.0409 1.0341 1.0975 1.0984 1.0966 1.0950 1.1038 1.1025 1.0878 1.0911 1.0959 1.0889 1.0976 1.0920 1.1001 1.0802
irintensity: 2.7080 0.0174 0.0911 0.2736 0.3392 3.4040 1.0451 0.3600 3.1774 0.8021 0.7673 3.0095 0.4393 1.3925 0.8276 4.6076 2.6340 0.4109 2.7580 0.1503 13.8914 0.6095 1.2374 2.0894 69.4588 8.8431 0.4111 4.8910 15.4334 3.7970 0.0011 5.3697 1.8733 26.1953 72.6832 3.9051 6.6177 39.7020 1.6193 1.4749 11.7607 0.5265 2.9575 1.4959 0.1696 0.2712 2.4337 7.6199 2.9175 1.5385 1.5216 19.3847 3.5247 12.6102 1.5099 3.9265 6.2797 77.0280 21.3989 0.8892 31.4618 13.3186 5.4763 30.8420 76.8163 44.8184 25.9498 13.5609 29.3893 4.6447 3.3161 51.0115 124.5242 46.0384 1.0844 36.8174 17.5485 49.8486 9.0654 15.8604 103.3603 1.4193 24.1176 1.5331 100.2535 112.5038 68.2952 25.4672 15.1725 6.4887 20.2182 5.1768 7.7061 12.5779 19.0445 4.4317 3.2852 0.7230 3.5566 10.9006 2.6586 11.3497 0.8740 0.1462 86.5000
temp: 298.150 k
press: 1.00000 atm
elementType: 7 7 6 6 6 6 6 6 6 6 6 6 6 6 6 6 6 6 6 6 1 1 1 1 1 1 1 1 1 1 1 1 1 1 1 1 1
symmnumber: 1
zpe: 798690.8 jmol-1
zpe.correction: 0.304205 hartree
zpe.thermalcorrener: 0.321173 hartree
zpe.thermalcorrenthalpy: 0.322117 hartree
zpe.thermalcorrgfe: 0.259703 hartree
zpe.sumelectzpe: -804.070737 hartree
zpe.sumelectthermal: -804.053770 hartree
zpe.sumelectthermalent: -804.052826 hartree
zpe.sumelectthermalfe: -804.115240 hartree
dipole: -6.7731 0.0809 0.0039
dipole: 6.7736
quadrupole: -30.6697 -78.3930 -120.8807
quadrupole: 10.6391 -0.0071 -0.0036
quadrupole: 45.9781 -1.7452 -44.2329 10.6391 -0.0071 -0.0036
hfenergy: -804.3749427 hartree
pointgroup: C01 [X(C18H17N2)]
dipole: 2.6649235 0.0008435 -0.0031934 debye
polarizability: 425.1106632|-0.0502566|217.8716227|-0.2091773|-1.6880659|90.2397924 unknown
InChI: InChI=1S/C18H17N2/c1-11-15-10-20(3)9-8-13(15)12(2)18-17(11)14-6-4-5-7-16(14)19-18/h4-10,19H,1-3H3
charge 1 multiplicity 1
37 atoms
N  -1.844903 1.722308 -0.022841
N  4.079856 -0.779412 0.006826
C  -0.767255 -0.313489 0.003847
C  -0.588531 1.138172 -0.015806
C  0.342161 -1.173555 0.01496
C  0.667433 1.776836 -0.025124
C  1.649176 -0.550265 0.005517
C  1.798102 0.915078 -0.014394
C  -2.211506 -0.558507 0.007835
C  -2.848388 0.727826 -0.009098
C  2.830906 -1.327734 0.014893
C  0.131596 -2.673523 0.035772
C  3.139525 1.435908 -0.022228
C  0.808753 3.286876 -0.045301
C  -3.026553 -1.719208 0.023356
C  -4.244332 0.890768 -0.010837
C  4.243638 0.607997 -0.011839
C  -4.429391 -1.570326 0.021678
C  -5.0305 -0.283013 0.00487
C  5.297085 -1.637753 0.015791
H  -2.029141 2.723866 -0.036486
H  2.797738 -2.417236 0.029009
H  3.308866 2.514391 -0.036565
H  -0.446099 -2.995793 -0.850098
H  1.060049 -3.262749 0.046022
H  -0.449388 -2.970461 0.928278
H  -0.165509 3.801729 -0.052916
H  1.354611 3.656907 0.841999
H  1.355761 3.63312 -0.94144
H  -2.594458 -2.722255 0.03642
H  -4.711759 1.880326 -0.023861
H  5.271008 0.974906 -0.017474
H  -5.067216 -2.459364 0.033457
H  -6.121934 -0.198405 0.003975
H  5.005464 -2.697759 0.036857
H  5.893841 -1.447856 -0.891285
H  5.903492 -1.415253 0.908934
