program: Gaussian 09
title: 000125735
version: EM64L-G09RevD.01
frameworkgroup: C1[X(C4H6FNO4)]
method: RPBEPBE
basis: SDD
operation: Freq
keyword: #p
keyword: freq=noraman
keyword: PBEPBE/SDD
title: #p freq=noraman PBEPBE/SDD
converged: YES YES NO NO
title: Mulliken charges:
elementType: F O O O O N C C C C H H H H H H
charge: -0.202495 -0.418496 -0.429036 -0.205832 -0.190503 -0.555335 -0.224447 -0.039467 0.172019 0.167954 0.285411 0.270716 0.299729 0.287171 0.390836 0.391775
chargesum: 0.00000
title: Mulliken charges with hydrogens summed into heavy atoms:
elementType: F O O O O N C C C C
charge: -0.202495 -0.027660 -0.037260 -0.205832 -0.190503 0.031564 0.060965 0.231250 0.172019 0.167954
polarizability: 7.05895111e+01 -7.89489618e+00 5.83690440e+01 2.25318902e+00 3.70063743e+00 5.61917643e+01
1716.lowfreq: -8.5198 -0.0007 0.0009 0.0013 6.3643 11.9266 37.2147 63.4537 88.0510
frequency: 37.1973 63.4353 88.0475 126.5996 165.2804 210.8170 246.8703 263.2502 334.2092 394.8851 451.6622 481.6568 512.8926 582.8720 598.8814 613.1397 661.4809 677.3475 742.2363 776.2738 896.8988 963.8270 1021.8468 1032.9895 1045.3114 1140.5970 1180.5566 1226.0150 1238.0293 1264.2009 1311.7628 1325.5853 1359.0302 1655.4213 1675.0363 1699.6784 3043.1465 3054.4111 3475.7886 3514.5461 3532.9363 3598.0624
redmass: 12.2652 5.6967 9.9077 5.4553 4.3923 1.6443 4.4191 4.5566 3.8006 5.1506 4.7168 4.9889 2.1028 2.9157 2.0822 1.4449 3.2207 1.6661 4.1264 3.9234 5.4671 4.8225 3.6772 2.4759 2.2292 1.8231 1.6597 1.4106 1.5736 1.6231 1.7504 1.7560 1.4243 1.0980 9.0386 10.1370 1.0833 1.0848 1.0460 1.0644 1.0644 1.0972
irintensity: 1.0470 1.3454 2.5049 2.1254 6.4092 34.5169 4.9529 12.0353 21.2966 1.6467 38.0898 12.3885 20.1896 56.9571 51.0057 182.3632 64.7348 293.0193 1.2083 6.7722 8.5135 135.4264 109.4393 115.7293 187.3708 17.2943 3.1439 3.3521 3.1114 19.6092 9.6372 11.6954 0.6824 26.0726 264.6047 228.5654 2.5987 8.5174 6.5959 23.3737 38.1144 11.1093
temp: 298.150 k
press: 1.00000 atm
elementType: 9 8 8 8 8 7 6 6 6 6 1 1 1 1 1 1
symmnumber: 1
zpe: 288806.7 jmol-1
zpe.correction: 0.110001 hartree
zpe.thermalcorrener: 0.120703 hartree
zpe.thermalcorrenthalpy: 0.121647 hartree
zpe.thermalcorrgfe: 0.072891 hartree
zpe.sumelectzpe: -610.730799 hartree
zpe.sumelectthermal: -610.720097 hartree
zpe.sumelectthermalent: -610.719153 hartree
zpe.sumelectthermalfe: -610.767909 hartree
dipole: -0.2538 0.9114 -3.5554
dipole: 3.6791
quadrupole: -56.6309 -52.1092 -60.0866
quadrupole: -2.2095 3.0446 -1.0446
quadrupole: -0.3553 4.1663 -3.8110 -2.2095 3.0446 -1.0446
hfenergy: -610.8407997 hartree
pointgroup: C01 [X(C4H6F1N1O4)]
dipole: -0.1506427 -0.612413 1.3028408 debye
dipolederiv: -0.3294275 -0.0409554 0.0715794 -0.0025087 -0.3173009 0.1233878 0.0363047 0.2052512 -0.5444757 -0.6295836 -0.3246542 -0.069682 -0.4303413 -0.9733209 -0.0159419 -0.1114887 -0.0516402 -0.3369359 -0.5418641 -0.0127724 0.3596976 -0.0307839 -0.4025505 0.248964 0.3035749 0.1879526 -1.0328758 -0.9575719 -0.1318358 0.1203914 0.0794915 -0.5413105 -0.1053573 0.2970644 -0.0503938 -0.3653584 -0.57727 -0.1363062 -0.2515788 -0.2081631 -0.3978917 -0.2115174 -0.0705296 -0.0058774 -0.8494467 -0.5385737 0.0159909 0.0150702 -0.0114264 -0.7578523 -0.2707815 -0.0373897 -0.2312472 -0.3313236 0.2651444 0.3273289 0.1208176 0.145138 0.3657159 0.1932229 0.1798128 0.1297949 0.1563607 0.2382417 -0.1529106 -0.1097031 -0.1512799 0.2992936 -0.1758609 -0.1468065 -0.3302388 0.5556907 1.2840634 0.3278872 -0.2310196 0.2164475 1.070639 0.188426 -0.4007093 0.1906042 0.284561 0.8796014 0.3232084 -0.0306656 0.4685978 0.5168396 0.0362289 -0.1345842 -0.0822761 1.4873676 0.1071072 -0.0157254 0.028075 -0.0323288 0.0269212 0.029108 0.0432178 0.0471778 0.0154565 0.0385924 0.0304183 0.050846 0.060259 -0.0064643 -0.0409158 0.0439231 0.0014278 0.0278256 0.2012406 -0.1162914 0.0220522 -0.0413222 0.339334 -0.0089527 0.0406152 0.0520817 0.1008247 0.0824504 -0.0589831 -0.1314454 0.0257266 0.2371767 0.1384808 -0.0357454 0.11083 0.2315406 0.2020076 0.0786323 0.0928868 0.0427701 0.2593668 -0.0821012 0.096047 -0.1040903 0.3013169 0.2758417 -0.1130318 -0.0573217 -0.1302762 0.2814043 -0.0463895 -0.1033063 -0.0693563 0.2994717 unknown
polarizability: 69.1482428|8.9131267|58.5265872|-0.1942363|4.4891421|57.4754894 unknown
InChI: InChI=1S/C4H6FNO4/c5-1(3(7)8)2(6)4(9)10/h1-2,7,9H,6H2
charge 0 multiplicity 1
16 atoms
F  -0.11327 1.301822 -1.224371
O  0.547629 -1.850741 -0.013092
O  -2.126957 -0.445398 1.24945
O  2.572414 -0.742559 -0.316852
O  -2.181662 -0.550949 -1.081856
N  1.583658 1.529467 1.163194
C  0.708211 0.398354 0.88405
C  -0.536795 0.896252 0.103967
C  1.405569 -0.754133 0.116719
C  -1.677364 -0.115278 -0.03627
H  0.326814 -0.020594 1.833281
H  -0.905702 1.798013 0.625109
H  2.009401 1.928506 0.320306
H  2.27929 1.35282 1.892083
H  0.976191 -2.567924 -0.553898
H  -2.867226 -1.106757 1.188779
