program: Gaussian 09
title: 000125744
version: EM64L-G09RevD.01
frameworkgroup: C1[X(C9H11FN2O5)]
method: RPBEPBE
basis: SDD
operation: Freq
keyword: #p
keyword: freq=noraman
keyword: PBEPBE/SDD
title: #p freq=noraman PBEPBE/SDD
converged: YES YES NO NO
title: Mulliken charges:
elementType: F O O O O O N N C C C C C C C C C H H H H H H H H H H H
charge: -0.202381 -0.243761 -0.430200 -0.442140 -0.251398 -0.237568 -0.174756 -0.405555 -0.197977 -0.033286 -0.116954 0.004693 -0.364977 0.243680 -0.035003 -0.307403 0.155467 0.249840 0.296117 0.261809 0.240386 0.218969 0.181191 0.356426 0.255937 0.363860 0.259529 0.355454
chargesum: 0.00000
title: Mulliken charges with hydrogens summed into heavy atoms:
elementType: F O O O O O N N C C C C C C C C C
charge: -0.202381 -0.243761 -0.073775 -0.086687 -0.251398 -0.237568 -0.174756 -0.041694 0.051864 0.228523 0.179163 0.245079 0.035183 0.243680 0.220934 -0.047874 0.155467
polarizability: 1.71407078e+02 -8.76661000e+00 1.06600198e+02 5.99164747e+00 -1.77008186e+01 1.03942553e+02
1716.lowfreq: -12.9100 -6.2169 0.0002 0.0005 0.0006 3.8646 15.2653 37.4809 41.1486
frequency: 14.1285 37.4675 41.1226 71.2359 79.6202 110.9660 143.2411 148.3641 164.7353 171.6324 178.4701 232.6683 251.1696 291.4896 303.4102 353.4125 376.7743 407.1782 433.0740 491.5212 515.8657 532.8372 544.6807 554.2025 595.8626 662.4183 685.2438 701.5083 744.5102 770.4862 805.1256 808.2747 826.7405 933.9650 940.0369 944.3008 961.1954 979.4083 1005.7602 1022.5317 1028.2949 1046.9951 1052.5342 1082.7433 1112.6401 1169.8096 1192.5629 1197.7943 1208.3555 1214.2261 1241.5643 1249.5440 1263.3594 1275.8668 1300.8520 1322.1028 1333.5520 1344.2783 1364.4622 1385.4670 1395.3083 1419.5498 1431.7192 1451.9385 1605.9425 1650.9864 1671.8918 2922.3748 2985.3688 2996.1379 3011.7124 3056.0967 3068.5245 3173.3233 3216.8522 3521.9577 3589.6834 3595.0108
redmass: 5.8129 7.3316 6.4230 8.1912 3.2848 1.3250 4.9867 1.2286 6.4004 7.9740 3.6989 6.3598 5.6235 5.3191 5.9120 6.1463 10.6237 3.3871 3.9418 3.7009 6.4799 5.0976 6.6608 4.6798 5.7494 5.3407 3.3696 2.1218 8.0393 1.7973 2.0314 3.6012 4.1850 1.6083 2.4363 5.6351 5.3339 6.1052 3.3424 3.5680 2.6969 3.0040 2.8452 2.5052 2.1323 3.4545 1.3222 1.2081 2.4590 1.2056 1.2149 1.3165 1.5206 1.3059 1.3227 2.9117 1.4020 1.3540 1.6157 1.5078 1.5025 1.5678 2.2657 1.0855 5.7042 11.0907 5.9281 1.0626 1.0838 1.0868 1.0966 1.0875 1.0852 1.0906 1.0978 1.0770 1.0670 1.0671
irintensity: 2.4685 0.9739 0.4684 0.6205 13.2487 157.3332 10.0728 143.4818 10.8402 6.6177 14.5647 3.1974 5.7821 20.5324 2.4945 3.1711 14.4598 4.4112 12.1547 27.2832 11.6676 1.8113 36.3657 24.0404 8.3111 12.7573 14.7694 13.5887 5.2122 34.8458 117.6321 13.8860 41.1809 6.6975 7.2865 189.2897 109.0854 42.0973 55.4876 13.2550 23.7858 57.0903 66.7899 20.1658 8.1921 29.6148 6.8808 8.1222 65.7467 15.2198 45.2020 28.3131 104.9576 35.7299 5.2703 133.6823 7.5451 0.4565 21.6966 4.8860 2.9923 1.4766 96.2029 8.7361 25.9027 255.0163 772.7776 79.1377 1.0530 18.4528 50.5454 12.8495 12.7512 3.5451 0.8323 61.4869 9.1519 16.9618
temp: 298.150 k
press: 1.00000 atm
elementType: 9 8 8 8 8 8 7 7 6 6 6 6 6 6 6 6 6 1 1 1 1 1 1 1 1 1 1 1
symmnumber: 1
zpe: 538247.9 jmol-1
zpe.correction: 0.205008 hartree
zpe.thermalcorrener: 0.221602 hartree
zpe.thermalcorrenthalpy: 0.222546 hartree
zpe.thermalcorrgfe: 0.158349 hartree
zpe.sumelectzpe: -933.724456 hartree
zpe.sumelectthermal: -933.707861 hartree
zpe.sumelectthermalent: -933.706917 hartree
zpe.sumelectthermalfe: -933.771114 hartree
dipole: -7.7462 -1.0063 0.3052
dipole: 7.8172
quadrupole: -91.5123 -109.8853 -101.1613
quadrupole: 7.1157 2.4980 4.0674
quadrupole: 9.3406 -9.0323 -0.3083 7.1157 2.4980 4.0674
hfenergy: -933.9294634 hartree
pointgroup: C01 [X(C9H11F1N2O5)]
dipole: 3.039268 -0.4399689 -0.1679832 debye
polarizability: 171.8539876|9.0319265|109.5476062|3.4103845|16.8724018|100.5482345 unknown
InChI: InChI=1S/C9H11FN2O5/c10-6-7(15)4(3-13)17-8(6)12-2-1-5(14)11-9(12)16/h1-2,4,6-8,11,13,15H,3H2
charge 0 multiplicity 1
28 atoms
F  1.261915 2.737961 -0.517565
O  1.309874 -0.474517 0.976194
O  3.163659 0.624074 -2.001457
O  3.419897 -2.698166 0.86807
O  -1.811485 1.575757 1.858467
O  -4.701395 -1.194567 -0.559069
N  -0.883346 0.190186 0.183783
N  -3.21267 0.176547 0.610193
C  2.650093 0.704653 -0.639149
C  1.234268 1.296076 -0.682205
C  0.477195 0.653585 0.510195
C  2.426161 -0.686443 0.007867
C  3.624911 -1.252062 0.754582
C  -1.965915 0.712307 0.955988
C  -1.083407 -0.810149 -0.769851
C  -2.321583 -1.313374 -1.071487
C  -3.510121 -0.821546 -0.372566
H  3.27988 1.34439 0.014183
H  0.361594 1.37746 1.334462
H  0.766463 1.097416 -1.662784
H  2.124188 -1.410116 -0.777578
H  3.695848 -0.756658 1.744539
H  4.551509 -1.039741 0.17385
H  4.15189 0.599872 -1.999618
H  -0.180356 -1.187803 -1.256185
H  -4.009395 0.545137 1.140288
H  -2.452966 -2.093705 -1.821176
H  3.966094 -3.063575 1.60703
